program: Orca
programVersion: 4.2.1
elementType: Cl N N N N C C C C C C C C C C C C C C C H H H H H H H H H H H H H H H H H
charge: 0
multiplicity: 1
keywords: wb97x-d3
keywords: def2-TZVPP
keywords: def2/J RIJCOSX GRIDX6 NOFINALGRIDX
keywords: grid4 nofinalgrid
keywords: scfconv7
keywords: smallprint printgap noloewdin
keywords: NOSOSCF
formula: C15H17ClN4
InChI: InChI=1/C15H17ClN4/c1-2-3-8-15(9-17,10-20-12-18-11-19-20)13-4-6-14(16)7-5-13/h4-7,11-12H,2-3,8,10H2,1H3
37 atoms
Cl -3.257869 3.417834 0.36347
N  -0.582096 -2.333754 -0.783875
N  -0.609452 -3.378264 0.047659
N  -2.689921 -2.738613 -0.476604
N  1.70501 -1.873636 2.106299
C  1.154608 -0.663043 -0.144104
C  2.492879 -0.090179 -0.663676
C  0.659013 -1.717398 -1.165155
C  3.100063 0.99181 0.218394
C  0.077049 0.395051 0.041918
C  4.400198 1.557816 -0.346869
C  1.438464 -1.341162 1.123027
C  -0.738807 0.435147 1.165431
C  -0.162227 1.306036 -0.984833
C  5.546687 0.558163 -0.398302
C  -1.765252 1.362836 1.273215
C  -1.181799 2.237677 -0.892668
C  -1.830465 -1.957806 -1.081902
C  -1.979532 2.258173 0.241163
C  -1.890933 -3.587478 0.20121
H  2.328098 0.301491 -1.670633
H  3.185826 -0.927125 -0.777553
H  1.405941 -2.498309 -1.299017
H  0.518508 -1.2250 -2.126489
H  3.287868 0.596607 1.221913
H  2.384459 1.80862 0.339993
H  4.699227 2.409319 0.269395
H  4.216499 1.961007 -1.347615
H  -0.594498 -0.258429 1.983977
H  0.44544 1.306335 -1.880966
H  5.74638 0.134099 0.588092
H  6.466228 1.03527 -0.740565
H  5.34719 -0.271747 -1.078221
H  -2.387901 1.376338 2.157256
H  -1.347914 2.938176 -1.699697
H  -2.056759 -1.132287 -1.739031
H  -2.26614 -4.386726 0.821386
elementType: Cl N C H
totalener: -1261.11330285 hartree
nucrepener: 1643.08257149 hartree
electener: -2904.19587434 hartree
oneelecener: -4983.05118167 hartree
twoeener: 2078.85530733 hartree
cpcmener: -0.03198629 hartree
kineticenergy: 1256.92996586 hartree
xcener: -100.364530146140 hartree
chargesum: 0.0000000
charge: -0.090561 0.122775 -0.341858 -0.400144 -0.055208 0.692518 -0.270999 -0.142063 -0.107848 -0.239696 -0.105421 -0.366380 -0.119585 -0.218504 -0.277872 -0.147289 -0.148440 0.051570 0.119146 0.070602 0.104750 0.121734 0.140574 0.144111 0.080909 0.087957 0.075465 0.059578 0.137337 0.141514 0.083329 0.093180 0.078673 0.145154 0.145688 0.172426 0.162879
qa: -0.0906 0.1228 -0.3419 -0.4001 -0.0552 0.6925 -0.2710 -0.1421 -0.1078 -0.2397 -0.1054 -0.3664 -0.1196 -0.2185 -0.2779 -0.1473 -0.1484 0.0516 0.1191 0.0706 0.1048 0.1217 0.1406 0.1441 0.0809 0.0880 0.0755 0.0596 0.1373 0.1415 0.0833 0.0932 0.0787 0.1452 0.1457 0.1724 0.1629
va: 1.2143 3.3575 2.8869 3.0285 3.1190 3.5291 3.9188 3.8934 3.8402 3.6335 3.8968 4.1230 3.8933 4.0093 3.9287 4.0426 4.0303 4.0719 3.8288 4.0334 1.0031 1.0043 1.0154 0.9932 1.0143 1.0141 1.0057 1.0077 1.0149 1.0093 1.0012 1.0039 0.9997 1.0061 1.0056 0.9938 0.9941
dispcorr: -0.019910339 hartree
energy: -1261.133213190178
dipole: 33.92164 -32.62473 1.29691 -1.70898 3.22930 1.52033 -7.09994 4.64149 -2.45845
magnitude: 3.16818 au
magnitude: 8.05286 debye
