program: Orca
programVersion: 4.2.1
elementType: Cl N N N N C C C C C C C C C C C C C C C H H H H H H H H H H H H H H H H H
charge: 0
multiplicity: 1
keywords: wb97x-d3
keywords: def2-TZVPP
keywords: def2/J RIJCOSX GRIDX6 NOFINALGRIDX
keywords: grid4 nofinalgrid
keywords: scfconv7
keywords: smallprint printgap noloewdin
keywords: NOSOSCF
formula: C15H17ClN4
InChI: InChI=1/C15H17ClN4/c1-2-3-8-15(9-17,10-20-12-18-11-19-20)13-4-6-14(16)7-5-13/h4-7,11-12H,2-3,8,10H2,1H3
37 atoms
Cl -2.181737 4.910473 0.663118
N  -0.610639 -2.89223 -0.658732
N  0.062384 -3.291002 -1.742341
N  -0.339971 -5.027004 -0.387615
N  0.561917 -1.787647 2.543813
C  0.111662 -0.655382 0.231967
C  1.442696 -0.655892 -0.552706
C  -0.978024 -1.51453 -0.464464
C  2.51166 0.245778 0.051433
C  -0.453542 0.751438 0.385486
C  3.865019 0.102029 -0.639011
C  0.364151 -1.261293 1.540768
C  -0.787907 1.299672 1.61697
C  -0.665824 1.514298 -0.761238
C  3.860411 0.511738 -2.104798
C  -1.318954 2.578641 1.71065
C  -1.196776 2.790003 -0.684508
C  -0.843389 -3.939388 0.140098
C  -1.520353 3.314904 0.557256
C  0.202282 -4.57436 -1.535763
H  1.221286 -0.360289 -1.580241
H  1.819816 -1.679413 -0.606847
H  -1.196909 -1.086721 -1.441094
H  -1.895245 -1.48406 0.122315
H  2.63546 0.01057 1.113203
H  2.19247 1.29091 0.005278
H  4.21111 -0.931984 -0.547543
H  4.592597 0.713189 -0.099095
H  -0.640896 0.743708 2.533903
H  -0.413617 1.127674 -1.740672
H  4.867721 0.480259 -2.522714
H  3.486279 1.530201 -2.231356
H  3.240808 -0.1452 -2.717418
H  -1.568968 2.987275 2.680121
H  -1.351173 3.365617 -1.586814
H  -1.382662 -3.861551 1.071425
H  0.710456 -5.211701 -2.242663
elementType: Cl N C H
totalener: -1261.11363089 hartree
nucrepener: 1611.92614244 hartree
electener: -2873.03977334 hartree
oneelecener: -4920.50619505 hartree
twoeener: 2047.46642171 hartree
cpcmener: -0.02680597 hartree
kineticenergy: 1256.91933198 hartree
xcener: -100.361298132109 hartree
chargesum: 0.0000000
charge: -0.091819 0.105084 -0.361475 -0.410952 -0.060001 0.706917 -0.243424 -0.130431 -0.107331 -0.209311 -0.110603 -0.384906 -0.129806 -0.229656 -0.277646 -0.151498 -0.159074 0.068411 0.115954 0.079830 0.106958 0.111365 0.138725 0.155951 0.085854 0.077501 0.061181 0.074504 0.136326 0.142075 0.094422 0.080883 0.080633 0.144849 0.145247 0.181919 0.163344
qa: -0.0918 0.1051 -0.3615 -0.4110 -0.0600 0.7069 -0.2434 -0.1304 -0.1073 -0.2093 -0.1106 -0.3849 -0.1298 -0.2297 -0.2776 -0.1515 -0.1591 0.0684 0.1160 0.0798 0.1070 0.1114 0.1387 0.1560 0.0859 0.0775 0.0612 0.0745 0.1363 0.1421 0.0944 0.0809 0.0806 0.1448 0.1452 0.1819 0.1633
va: 1.2131 3.3582 2.8633 3.0354 3.1170 3.4679 3.8737 3.8528 3.8566 3.6480 3.8943 4.1002 3.9416 4.0478 3.9248 4.0302 4.0397 4.0543 3.8277 4.0248 1.0045 1.0163 1.0093 0.9997 1.0168 1.0097 1.0094 1.0067 1.0165 1.0084 1.0041 1.0018 0.9993 1.0074 1.0063 0.9913 0.9936
dispcorr: -0.018945542 hartree
energy: -1261.132576437182
dipole: 22.49287 -22.96067 -0.46781 -8.79557 10.25141 1.45583 -10.28459 9.18071 -1.10388
magnitude: 1.88596 au
magnitude: 4.79373 debye
