program: Orca
programVersion: 4.2.1
elementType: Cl N N N N C C C C C C C C C C C C C C C H H H H H H H H H H H H H H H H H
charge: 0
multiplicity: 1
keywords: wb97x-d3
keywords: def2-TZVPP
keywords: def2/J RIJCOSX GRIDX6 NOFINALGRIDX
keywords: grid4 nofinalgrid
keywords: scfconv7
keywords: smallprint printgap noloewdin
keywords: NOSOSCF
formula: C15H17ClN4
InChI: InChI=1/C15H17ClN4/c1-2-3-8-15(9-17,10-20-12-18-11-19-20)13-4-6-14(16)7-5-13/h4-7,11-12H,2-3,8,10H2,1H3
37 atoms
Cl -3.000796 3.520211 0.381521
N  -0.742865 -2.418096 -0.759385
N  -0.813012 -3.42832 0.111453
N  -2.863056 -2.685823 -0.394677
N  1.691945 -2.032971 2.038627
C  1.116346 -0.848241 -0.219234
C  2.462801 -0.361122 -0.801621
C  0.523109 -1.894684 -1.194685
C  3.171077 0.694363 0.034627
C  0.1112 0.276198 -0.016027
C  4.497848 1.115439 -0.585876
C  1.412222 -1.512887 1.052469
C  -0.650638 0.391893 1.139849
C  -0.115466 1.179144 -1.053008
C  5.212025 2.179535 0.232924
C  -1.60914 1.386771 1.270316
C  -1.067465 2.177597 -0.938209
C  -1.972942 -1.980091 -1.046141
C  -1.809876 2.274049 0.22872
C  -2.10072 -3.555003 0.298884
H  2.279219 0.021633 -1.808341
H  3.110818 -1.232953 -0.926194
H  1.214304 -2.725379 -1.32701
H  0.384448 -1.420486 -2.165099
H  3.352531 0.313176 1.044522
H  2.531143 1.574017 0.148167
H  4.323258 1.490324 -1.598917
H  5.144499 0.23928 -0.692168
H  -0.515634 -0.293339 1.966933
H  0.448509 1.119664 -1.975451
H  6.158893 2.467091 -0.226274
H  5.431817 1.825292 1.242042
H  4.605921 3.082924 0.327078
H  -2.190009 1.45831 2.179678
H  -1.22394 2.870722 -1.753539
H  -2.164509 -1.167672 -1.729902
H  -2.508318 -4.307538 0.956139
elementType: Cl N C H
totalener: -1261.11477244 hartree
nucrepener: 1638.90185752 hartree
electener: -2900.01662996 hartree
oneelecener: -4974.70028046 hartree
twoeener: 2074.68365050 hartree
cpcmener: -0.03221966 hartree
kineticenergy: 1256.92944503 hartree
xcener: -100.363250356885 hartree
chargesum: 0.0000000
charge: -0.091086 0.123194 -0.343251 -0.400235 -0.056427 0.693466 -0.248522 -0.144697 -0.106471 -0.237353 -0.078869 -0.365235 -0.118177 -0.225072 -0.284533 -0.150057 -0.142744 0.053294 0.118447 0.070417 0.103136 0.114854 0.141519 0.144226 0.076188 0.073059 0.061993 0.061752 0.137434 0.141457 0.091459 0.080455 0.079921 0.145278 0.146302 0.172164 0.162713
qa: -0.0911 0.1232 -0.3433 -0.4002 -0.0564 0.6935 -0.2485 -0.1447 -0.1065 -0.2374 -0.0789 -0.3652 -0.1182 -0.2251 -0.2845 -0.1501 -0.1427 0.0533 0.1184 0.0704 0.1031 0.1149 0.1415 0.1442 0.0762 0.0731 0.0620 0.0618 0.1374 0.1415 0.0915 0.0805 0.0799 0.1453 0.1463 0.1722 0.1627
va: 1.2137 3.3581 2.8841 3.0291 3.1197 3.5213 3.9087 3.8954 3.8365 3.6336 3.8758 4.1206 3.8941 4.0080 3.9495 4.0448 4.0242 4.0707 3.8292 4.0342 1.0046 1.0092 1.0142 0.9930 1.0156 1.0113 1.0064 1.0081 1.0149 1.0096 1.0039 1.0003 1.0004 1.0061 1.0052 0.9940 0.9942
dispcorr: -0.019573437 hartree
energy: -1261.134345874718
dipole: 32.70430 -31.41851 1.28578 0.17988 1.14066 1.32055 -6.54965 3.98166 -2.56799
magnitude: 3.16096 au
magnitude: 8.03452 debye
