program: Orca
programVersion: 4.2.1
elementType: Cl N N N N C C C C C C C C C C C C C C C H H H H H H H H H H H H H H H H H
charge: 0
multiplicity: 1
keywords: wb97x-d3
keywords: def2-TZVPP
keywords: def2/J RIJCOSX GRIDX6 NOFINALGRIDX
keywords: grid4 nofinalgrid
keywords: scfconv7
keywords: smallprint printgap noloewdin
keywords: NOSOSCF
formula: C15H17ClN4
InChI: InChI=1/C15H17ClN4/c1-2-3-8-15(9-17,10-20-12-18-11-19-20)13-4-6-14(16)7-5-13/h4-7,11-12H,2-3,8,10H2,1H3
37 atoms
Cl -3.100218 3.498174 0.212555
N  -0.619212 -2.440784 -0.33675
N  -1.892408 -2.036344 -0.331211
N  -1.37303 -2.954424 -2.305591
N  2.222922 -0.810054 3.089443
C  0.997423 -0.894445 0.781086
C  2.093871 -0.908723 -0.305153
C  0.230036 -2.249866 0.807395
C  2.965913 0.339024 -0.350769
C  0.011149 0.258447 0.648533
C  4.022269 0.252624 -1.446079
C  1.682299 -0.82303 2.074939
C  -0.601706 0.811514 1.767216
C  -0.362163 0.723763 -0.608022
C  4.881336 1.504739 -1.525184
C  -1.55744 1.807992 1.643498
C  -1.316297 1.71715 -0.750019
C  -0.324086 -2.988196 -1.521956
C  -1.908853 2.253393 0.380827
C  -2.303515 -2.363204 -1.528013
H  1.624423 -1.063192 -1.279163
H  2.720837 -1.787945 -0.133124
H  -0.397505 -2.3077 1.695005
H  0.946809 -3.069885 0.84977
H  3.460966 0.484694 0.614679
H  2.349201 1.226721 -0.515753
H  3.533345 0.084428 -2.410567
H  4.659208 -0.619411 -1.270208
H  -0.34599 0.475034 2.764425
H  0.082473 0.322111 -1.508425
H  4.276468 2.388077 -1.739235
H  5.632358 1.42343 -2.312267
H  5.408373 1.687385 -0.586659
H  -2.017374 2.227539 2.52761
H  -1.590371 2.063517 -1.737007
H  0.644257 -3.403424 -1.754894
H  -3.314173 -2.172732 -1.854579
elementType: Cl N C H
totalener: -1261.11201876 hartree
nucrepener: 1642.77555121 hartree
electener: -2903.88756997 hartree
oneelecener: -4982.37154619 hartree
twoeener: 2078.48397622 hartree
cpcmener: -0.02910684 hartree
kineticenergy: 1256.91755037 hartree
xcener: -100.361043745815 hartree
chargesum: 0.0000000
charge: -0.094136 0.110455 -0.339305 -0.400833 -0.069192 0.621472 -0.273499 -0.147796 -0.127634 -0.031871 -0.076011 -0.324617 -0.201817 -0.257905 -0.286612 -0.154207 -0.135329 0.049832 0.105299 0.067759 0.100414 0.117881 0.145088 0.152475 0.078506 0.077954 0.062761 0.061718 0.136569 0.142072 0.080408 0.091805 0.079755 0.143987 0.144854 0.187096 0.162604
qa: -0.0941 0.1105 -0.3393 -0.4008 -0.0692 0.6215 -0.2735 -0.1478 -0.1276 -0.0319 -0.0760 -0.3246 -0.2018 -0.2579 -0.2866 -0.1542 -0.1353 0.0498 0.1053 0.0678 0.1004 0.1179 0.1451 0.1525 0.0785 0.0780 0.0628 0.0617 0.1366 0.1421 0.0804 0.0918 0.0798 0.1440 0.1449 0.1871 0.1626
va: 1.2105 3.3571 2.8668 3.0382 3.1261 3.5401 3.8948 3.8875 3.8653 3.5473 3.8643 4.1013 4.0509 3.9663 3.9518 4.0214 4.0238 4.0571 3.8435 4.0320 1.0007 1.0081 1.0083 0.9991 1.0164 1.0104 1.0068 1.0081 1.0119 1.0033 1.0004 1.0035 1.0004 1.0067 1.0048 0.9862 0.9952
dispcorr: -0.019758665 hartree
energy: -1261.131777428103
dipole: 30.27028 -29.25622 1.01406 -6.64623 5.96881 -0.67742 -8.46406 7.60179 -0.86227
magnitude: 1.49356 au
magnitude: 3.79634 debye
