program: Orca
programVersion: 4.2.1
elementType: Cl N N N N C C C C C C C C C C C C C C C H H H H H H H H H H H H H H H H H
charge: 0
multiplicity: 1
keywords: wb97x-d3
keywords: def2-TZVPP
keywords: def2/J RIJCOSX GRIDX6 NOFINALGRIDX
keywords: grid4 nofinalgrid
keywords: scfconv7
keywords: smallprint printgap noloewdin
keywords: NOSOSCF
formula: C15H17ClN4
InChI: InChI=1/C15H17ClN4/c1-2-3-8-15(9-17,10-20-12-18-11-19-20)13-4-6-14(16)7-5-13/h4-7,11-12H,2-3,8,10H2,1H3
37 atoms
Cl -2.13889 4.926856 0.549791
N  -0.723611 -2.957023 -0.553049
N  -0.229173 -3.377961 -1.721081
N  -0.346527 -5.073432 -0.26477
N  0.79765 -1.681441 2.466167
C  0.062966 -0.680311 0.165904
C  1.294656 -0.719373 -0.766042
C  -1.092905 -1.581228 -0.346193
C  2.425453 0.20472 -0.334918
C  -0.488526 0.733735 0.307193
C  3.642705 0.073726 -1.24224
C  0.475152 -1.211436 1.46753
C  -0.656849 1.359763 1.535359
C  -0.8479 1.427988 -0.846614
C  4.786929 0.981232 -0.819504
C  -1.164088 2.649197 1.618298
C  -1.357085 2.71301 -0.780506
C  -0.787402 -3.980099 0.305739
C  -1.510178 3.317362 0.457766
C  -0.016085 -4.648569 -1.500636
H  0.963384 -0.465924 -1.776116
H  1.666132 -1.744857 -0.818157
H  -1.458164 -1.191581 -1.294521
H  -1.919269 -1.549243 0.36319
H  2.72211 -0.021179 0.695157
H  2.085377 1.244285 -0.335057
H  3.354994 0.303112 -2.272856
H  3.984144 -0.965881 -1.246077
H  -0.391758 0.859567 2.457943
H  -0.727775 0.98058 -1.825177
H  5.123715 0.75241 0.193754
H  4.491904 2.032437 -0.837495
H  5.646957 0.87175 -1.481923
H  -1.282344 3.119304 2.584836
H  -1.626893 3.234066 -1.68873
H  -1.164098 -3.881804 1.311927
H  0.383112 -5.298575 -2.263681
elementType: Cl N C H
totalener: -1261.11482290 hartree
nucrepener: 1603.19348905 hartree
electener: -2864.30831195 hartree
oneelecener: -4903.04681059 hartree
twoeener: 2038.73849864 hartree
cpcmener: -0.02674759 hartree
kineticenergy: 1256.91750198 hartree
xcener: -100.359925233259 hartree
chargesum: 0.0000000
charge: -0.091661 0.100679 -0.358425 -0.410589 -0.060047 0.709951 -0.215515 -0.129023 -0.113100 -0.227353 -0.078194 -0.387838 -0.125819 -0.219130 -0.285668 -0.153345 -0.163397 0.070613 0.118582 0.077963 0.105070 0.105368 0.137435 0.156718 0.074735 0.072938 0.061364 0.062429 0.136922 0.141370 0.080333 0.079109 0.091603 0.144718 0.146066 0.181657 0.163481
qa: -0.0917 0.1007 -0.3584 -0.4106 -0.0600 0.7100 -0.2155 -0.1290 -0.1131 -0.2274 -0.0782 -0.3878 -0.1258 -0.2191 -0.2857 -0.1533 -0.1634 0.0706 0.1186 0.0780 0.1051 0.1054 0.1374 0.1567 0.0747 0.0729 0.0614 0.0624 0.1369 0.1414 0.0803 0.0791 0.0916 0.1447 0.1461 0.1817 0.1635
va: 1.2132 3.3615 2.8657 3.0359 3.1170 3.4468 3.8742 3.8499 3.8599 3.6656 3.8764 4.1036 3.9357 4.0417 3.9480 4.0341 4.0407 4.0535 3.8262 4.0271 1.0107 1.0172 1.0110 0.9992 1.0130 1.0109 1.0065 1.0077 1.0162 1.0082 1.0003 1.0006 1.0038 1.0076 1.0063 0.9916 0.9938
dispcorr: -0.018486656 hartree
energy: -1261.133309556250
dipole: 23.54981 -24.18434 -0.63454 -8.16178 9.52486 1.36308 -8.50382 7.41271 -1.09112
magnitude: 1.85773 au
magnitude: 4.72198 debye
