program: Orca
programVersion: 4.2.1
elementType: Cl N N N N C C C C C C C C C C C C C C C H H H H H H H H H H H H H H H H H
charge: 0
multiplicity: 1
keywords: wb97x-d3
keywords: def2-TZVPP
keywords: def2/J RIJCOSX GRIDX6 NOFINALGRIDX
keywords: grid4 nofinalgrid
keywords: scfconv7
keywords: smallprint printgap noloewdin
keywords: NOSOSCF
formula: C15H17ClN4
InChI: InChI=1/C15H17ClN4/c1-2-3-8-15(9-17,10-20-12-18-11-19-20)13-4-6-14(16)7-5-13/h4-7,11-12H,2-3,8,10H2,1H3
37 atoms
Cl -2.008022 5.010174 0.717776
N  -0.281781 -2.88555 -0.732357
N  0.745356 -3.236214 -1.516549
N  -0.046879 -5.022536 -0.419905
N  -0.514517 -1.893474 2.68577
C  -0.020091 -0.684443 0.41772
C  1.518503 -0.651223 0.232208
C  -0.729603 -1.521856 -0.6723
C  1.995556 -0.030836 -1.072441
C  -0.576045 0.735192 0.478509
C  3.517708 0.037781 -1.132382
C  -0.296083 -1.349262 1.696649
C  -0.425603 1.478688 1.646455
C  -1.177659 1.349261 -0.613682
C  4.023594 0.646056 -2.431648
C  -0.859643 2.789288 1.727979
C  -1.621119 2.661927 -0.546447
C  -0.740617 -3.968215 -0.08247
C  -1.459027 3.378054 0.625624
C  0.850919 -4.522628 -1.294198
H  1.907375 -1.668377 0.315558
H  1.935784 -0.093992 1.075286
H  -0.552279 -1.091442 -1.654806
H  -1.805574 -1.511974 -0.493056
H  1.586125 0.976756 -1.188996
H  1.641418 -0.62314 -1.919766
H  3.928525 -0.968692 -1.014226
H  3.890145 0.620687 -0.284828
H  0.03059 1.030872 2.520752
H  -1.313436 0.823571 -1.548315
H  3.697156 0.063563 -3.29436
H  5.11246 0.685808 -2.455147
H  3.654496 1.664452 -2.563117
H  -0.736799 3.34722 2.645664
H  -2.089395 3.120997 -1.405824
H  -1.563473 -3.936052 0.614949
H  1.597366 -5.125656 -1.786775
totalener: -1261.08597468 hartree
nucrepener: 1611.17001185 hartree
electener: -2872.25598652 hartree
oneelecener: -4919.20251541 hartree
twoeener: 2046.94652889 hartree
kineticenergy: 1256.92614760 hartree
xcener: -100.360235523679 hartree
chargesum: 0.0000000
charge: -0.067268 0.123026 -0.333555 -0.328707 0.019513 0.634339 -0.235114 -0.274717 -0.114542 -0.055729 -0.096197 -0.395833 -0.177645 -0.215400 -0.265356 -0.146797 -0.115852 0.060577 0.099997 0.071490 0.115360 0.106281 0.128201 0.158546 0.078780 0.070545 0.067569 0.059313 0.128643 0.119530 0.078798 0.088281 0.073492 0.126523 0.123819 0.154317 0.135772
qa: -0.0673 0.1230 -0.3336 -0.3287 0.0195 0.6343 -0.2351 -0.2747 -0.1145 -0.0557 -0.0962 -0.3958 -0.1776 -0.2154 -0.2654 -0.1468 -0.1159 0.0606 0.1000 0.0715 0.1154 0.1063 0.1282 0.1585 0.0788 0.0705 0.0676 0.0593 0.1286 0.1195 0.0788 0.0883 0.0735 0.1265 0.1238 0.1543 0.1358
va: 1.2393 3.2906 2.8342 3.0698 3.1187 3.4763 3.9210 3.9547 3.7952 3.6245 3.9086 4.0292 4.0569 3.9739 3.9524 4.0519 4.0508 4.0681 3.9384 4.0416 1.0135 1.0116 0.9985 0.9937 1.0081 1.0246 1.0072 1.0076 1.0128 1.0165 1.0026 1.0060 1.0029 1.0128 1.0138 0.9999 0.9995
dispcorr: -0.018906472 hartree
energy: -1261.104881149326
dipole: 22.49496 -22.42633 0.06863 -9.13735 10.31527 1.17792 -12.67661 11.69111 -0.98550
magnitude: 1.53734 au
magnitude: 3.90762 debye
