program: Orca
programVersion: 4.2.1
elementType: Cl N N N N C C C C C C C C C C C C C C C H H H H H H H H H H H H H H H H H
charge: 0
multiplicity: 1
keywords: wb97x-d3
keywords: def2-TZVPP
keywords: def2/J RIJCOSX GRIDX6 NOFINALGRIDX
keywords: grid4 nofinalgrid
keywords: scfconv7
keywords: smallprint printgap noloewdin
keywords: NOSOSCF
formula: C15H17ClN4
InChI: InChI=1/C15H17ClN4/c1-2-3-8-15(9-17,10-20-12-18-11-19-20)13-4-6-14(16)7-5-13/h4-7,11-12H,2-3,8,10H2,1H3
37 atoms
Cl -3.26725 3.409887 0.337646
N  -0.5878 -2.332481 -0.776799
N  -0.608113 -3.429303 -0.01235
N  -2.695939 -2.730504 -0.436124
N  1.710519 -1.835082 2.131825
C  1.156773 -0.660813 -0.137015
C  2.49406 -0.09306 -0.662482
C  0.652631 -1.71968 -1.151224
C  3.106134 0.991205 0.213943
C  0.082138 0.401824 0.038009
C  4.404746 1.556805 -0.355779
C  1.439978 -1.326284 1.137477
C  -0.744558 0.436684 1.153435
C  -0.15238 1.317135 -0.985334
C  5.55367 0.558243 -0.401259
C  -1.775253 1.359038 1.252856
C  -1.176447 2.244056 -0.899932
C  -1.846682 -1.924703 -1.014326
C  -1.987755 2.259753 0.224537
C  -1.889099 -3.632504 0.164657
H  2.333984 0.296875 -1.672337
H  3.188403 -0.930052 -0.771638
H  1.39409 -2.50872 -1.271816
H  0.522915 -1.228395 -2.116579
H  3.293999 0.592136 1.214941
H  2.387166 1.804261 0.338951
H  4.702082 2.412554 0.254548
H  4.22147 1.956094 -1.358333
H  -0.598549 -0.264167 1.964962
H  0.468489 1.324234 -1.872791
H  5.752028 0.142329 0.587812
H  6.4716 1.032655 -0.74789
H  5.353304 -0.277043 -1.073418
H  -2.411073 1.368545 2.126959
H  -1.341669 2.950468 -1.701501
H  -2.086005 -1.051652 -1.602469
H  -2.257538 -4.463474 0.744886
totalener: -1261.08447966 hartree
nucrepener: 1642.42974437 hartree
electener: -2903.51422403 hartree
oneelecener: -4981.85246543 hartree
twoeener: 2078.33824140 hartree
kineticenergy: 1256.93421695 hartree
xcener: -100.361775235338 hartree
chargesum: 0.0000000
charge: -0.065091 0.117067 -0.297307 -0.323547 0.033963 0.670541 -0.285100 -0.164464 -0.112103 -0.240183 -0.106917 -0.407252 -0.087838 -0.230510 -0.257931 -0.110762 -0.143732 0.027787 0.105908 0.070141 0.089320 0.114769 0.131970 0.129114 0.091229 0.088840 0.076347 0.053161 0.133369 0.119775 0.086422 0.089427 0.070548 0.127386 0.125837 0.144320 0.135496
qa: -0.0651 0.1171 -0.2973 -0.3235 0.0340 0.6705 -0.2851 -0.1645 -0.1121 -0.2402 -0.1069 -0.4073 -0.0878 -0.2305 -0.2579 -0.1108 -0.1437 0.0278 0.1059 0.0701 0.0893 0.1148 0.1320 0.1291 0.0912 0.0888 0.0763 0.0532 0.1334 0.1198 0.0864 0.0894 0.0705 0.1274 0.1258 0.1443 0.1355
va: 1.2412 3.3226 2.8702 3.0633 3.1160 3.5290 3.9207 3.9188 3.8438 3.6823 3.8993 4.0831 3.9147 4.0139 3.9308 4.0365 4.0705 4.0889 3.9313 4.0324 1.0043 1.0083 1.0199 0.9924 1.0159 1.0146 1.0075 1.0077 1.0189 1.0146 1.0034 1.0058 1.0025 1.0122 1.0135 0.9999 0.9996
dispcorr: -0.019940672 hartree
energy: -1261.104420333237
dipole: 33.97013 -33.00740 0.96273 -1.70502 2.91732 1.21229 -7.00288 5.43729 -1.56559
magnitude: 2.20172 au
magnitude: 5.59633 debye
