program: Orca
programVersion: 4.2.1
elementType: Cl N N N N C C C C C C C C C C C C C C C H H H H H H H H H H H H H H H H H
charge: 0
multiplicity: 1
keywords: wb97x-d3
keywords: def2-TZVPP
keywords: def2/J RIJCOSX GRIDX6 NOFINALGRIDX
keywords: grid4 nofinalgrid
keywords: scfconv7
keywords: smallprint printgap noloewdin
keywords: NOSOSCF
formula: C15H17ClN4
InChI: InChI=1/C15H17ClN4/c1-2-3-8-15(9-17,10-20-12-18-11-19-20)13-4-6-14(16)7-5-13/h4-7,11-12H,2-3,8,10H2,1H3
37 atoms
Cl -2.993419 3.519441 0.376216
N  -0.647903 -2.346017 -0.841907
N  -0.780325 -3.468783 -0.127744
N  -2.792394 -2.608499 -0.615868
N  1.517917 -2.122098 2.193949
C  1.168458 -0.824767 -0.048614
C  2.564897 -0.327858 -0.482415
C  0.64857 -1.806872 -1.129863
C  3.210043 0.6567 0.483364
C  0.160539 0.303057 0.117266
C  4.597475 1.109884 0.036614
C  1.337063 -1.558613 1.208754
C  -0.727043 0.34468 1.184818
C  0.049019 1.27851 -0.870833
C  4.601056 1.917919 -1.254501
C  -1.698031 1.330737 1.271781
C  -0.91466 2.269029 -0.797455
C  -1.86288 -1.841458 -1.118698
C  -1.788682 2.289813 0.278837
C  -2.079282 -3.587753 -0.01763
H  2.473864 0.115699 -1.476893
H  3.213456 -1.201077 -0.602299
H  1.340761 -2.640369 -1.244017
H  0.60339 -1.272929 -2.080248
H  3.287111 0.192552 1.4698
H  2.565576 1.53175 0.605466
H  5.251028 0.239057 -0.070392
H  5.033545 1.713686 0.835536
H  -0.676752 -0.401096 1.967287
H  0.720128 1.283594 -1.720812
H  3.935707 2.780154 -1.180725
H  4.282453 1.327083 -2.114396
H  5.599008 2.293094 -1.480214
H  -2.382745 1.3444 2.108015
H  -0.984332 3.020828 -1.571197
H  -2.012584 -0.930655 -1.678493
H  -2.531245 -4.413757 0.507867
totalener: -1261.08451385 hartree
nucrepener: 1647.15374742 hartree
electener: -2908.23826126 hartree
oneelecener: -4991.26570236 hartree
twoeener: 2083.02744110 hartree
kineticenergy: 1256.93443092 hartree
xcener: -100.361993329259 hartree
chargesum: 0.0000000
charge: -0.065319 0.116304 -0.297458 -0.323256 0.033881 0.660770 -0.272331 -0.163711 -0.115321 -0.226294 -0.102610 -0.412764 -0.087770 -0.231308 -0.262884 -0.110554 -0.142182 0.026538 0.105439 0.071015 0.085392 0.110665 0.132701 0.130114 0.097228 0.081317 0.058174 0.076282 0.132993 0.118664 0.080886 0.068810 0.094559 0.127310 0.125098 0.144822 0.134802
qa: -0.0653 0.1163 -0.2975 -0.3233 0.0339 0.6608 -0.2723 -0.1637 -0.1153 -0.2263 -0.1026 -0.4128 -0.0878 -0.2313 -0.2629 -0.1106 -0.1422 0.0265 0.1054 0.0710 0.0854 0.1107 0.1327 0.1301 0.0972 0.0813 0.0582 0.0763 0.1330 0.1187 0.0809 0.0688 0.0946 0.1273 0.1251 0.1448 0.1348
va: 1.2411 3.3233 2.8691 3.0631 3.1155 3.5479 3.9105 3.9168 3.8534 3.6709 3.8926 4.0871 3.9143 4.0162 3.9211 4.0365 4.0672 4.0897 3.9320 4.0322 1.0043 1.0128 1.0188 0.9916 1.0215 1.0102 1.0100 1.0083 1.0190 1.0125 1.0031 1.0014 1.0077 1.0122 1.0137 0.9997 0.9998
dispcorr: -0.020147150 hartree
energy: -1261.104660996152
dipole: 32.02207 -30.88895 1.13312 -0.14539 1.34941 1.20402 -7.76982 6.30577 -1.46405
magnitude: 2.20841 au
magnitude: 5.61333 debye
