program: Orca
programVersion: 4.2.1
elementType: Cl N N N N C C C C C C C C C C C C C C C H H H H H H H H H H H H H H H H H
charge: 0
multiplicity: 1
keywords: wb97x-d3
keywords: def2-TZVPP
keywords: def2/J RIJCOSX GRIDX6 NOFINALGRIDX
keywords: grid4 nofinalgrid
keywords: scfconv7
keywords: smallprint printgap noloewdin
keywords: NOSOSCF
formula: C15H17ClN4
InChI: InChI=1/C15H17ClN4/c1-2-3-8-15(9-17,10-20-12-18-11-19-20)13-4-6-14(16)7-5-13/h4-7,11-12H,2-3,8,10H2,1H3
37 atoms
Cl -2.448968 4.900311 0.478747
N  -0.505378 -2.860894 -0.587278
N  0.050148 -3.250833 -1.74101
N  -0.008455 -4.954331 -0.285842
N  0.72944 -1.517077 2.541672
C  0.120345 -0.553662 0.188772
C  1.402524 -0.532105 -0.670778
C  -0.951952 -1.508905 -0.402674
C  2.464347 0.434859 -0.16441
C  -0.514965 0.827115 0.30123
C  3.699056 0.484204 -1.061101
C  0.468058 -1.070866 1.514627
C  -0.8251 1.414943 1.520691
C  -0.820451 1.526924 -0.864148
C  4.468961 -0.827515 -1.137896
C  -1.419893 2.666539 1.582283
C  -1.414331 2.775436 -0.818024
C  -0.528451 -3.893579 0.271867
C  -1.712522 3.342163 0.411513
C  0.331856 -4.50939 -1.51327
H  1.122134 -0.280214 -1.69738
H  1.804397 -1.544592 -0.715461
H  -1.263758 -1.133739 -1.375656
H  -1.827476 -1.510504 0.247554
H  2.767261 0.151411 0.848798
H  2.041369 1.439634 -0.087197
H  4.363039 1.266484 -0.686099
H  3.405099 0.798683 -2.067192
H  -0.598488 0.906105 2.448412
H  -0.585896 1.108698 -1.835095
H  3.889313 -1.621393 -1.60965
H  4.754563 -1.175293 -0.143761
H  5.383017 -0.710807 -1.719972
H  -1.649754 3.1110 2.540396
H  -1.640454 3.306121 -1.732152
H  -0.92375 -3.821415 1.273208
H  0.79325 -5.133833 -2.261894
totalener: -1261.08778196 hartree
nucrepener: 1611.21442953 hartree
electener: -2872.30221149 hartree
oneelecener: -4919.31873188 hartree
twoeener: 2047.01652039 hartree
kineticenergy: 1256.93135456 hartree
xcener: -100.360907755424 hartree
chargesum: 0.0000000
charge: -0.067586 0.098463 -0.325709 -0.328991 0.025359 0.686238 -0.250144 -0.167923 -0.111054 -0.220292 -0.108966 -0.448060 -0.107455 -0.208826 -0.260293 -0.134392 -0.152026 0.060443 0.108112 0.072140 0.101754 0.115541 0.132660 0.144488 0.086369 0.086164 0.074098 0.054888 0.133261 0.123114 0.075766 0.083215 0.088767 0.127035 0.125943 0.152402 0.135495
qa: -0.0676 0.0985 -0.3257 -0.3290 0.0254 0.6862 -0.2501 -0.1679 -0.1111 -0.2203 -0.1090 -0.4481 -0.1075 -0.2088 -0.2603 -0.1344 -0.1520 0.0604 0.1081 0.0721 0.1018 0.1155 0.1327 0.1445 0.0864 0.0862 0.0741 0.0549 0.1333 0.1231 0.0758 0.0832 0.0888 0.1270 0.1259 0.1524 0.1355
va: 1.2390 3.3145 2.8421 3.0690 3.1150 3.4889 3.8956 3.8916 3.8393 3.7057 3.9075 4.0683 3.9518 4.0563 3.9320 4.0449 4.0817 4.0687 3.9258 4.0345 1.0112 1.0108 1.0135 1.0014 1.0123 1.0145 1.0070 1.0080 1.0215 1.0144 1.0034 1.0026 1.0059 1.0139 1.0136 1.0013 1.0001
dispcorr: -0.018927065 hartree
energy: -1261.106709021019
dipole: 23.96653 -24.29120 -0.32467 -11.16624 12.29108 1.12485 -8.54483 7.73294 -0.81189
magnitude: 1.42473 au
magnitude: 3.62137 debye
