program: Orca
programVersion: 4.2.1
elementType: Cl N N N N C C C C C C C C C C C C C C C H H H H H H H H H H H H H H H H H
charge: 0
multiplicity: 1
keywords: wb97x-d3
keywords: def2-TZVPP
keywords: def2/J RIJCOSX GRIDX6 NOFINALGRIDX
keywords: grid4 nofinalgrid
keywords: scfconv7
keywords: smallprint printgap noloewdin
keywords: NOSOSCF
formula: C15H17ClN4
InChI: InChI=1/C15H17ClN4/c1-2-3-8-15(9-17,10-20-12-18-11-19-20)13-4-6-14(16)7-5-13/h4-7,11-12H,2-3,8,10H2,1H3
37 atoms
Cl -3.06032 3.559389 0.254931
N  -0.608815 -2.473706 -0.36583
N  -1.895563 -2.113205 -0.388113
N  -1.302219 -3.007659 -2.356272
N  2.219922 -0.866323 3.074428
C  0.974533 -0.894656 0.774453
C  2.062627 -0.897535 -0.319983
C  0.203592 -2.24883 0.795781
C  2.938616 0.347622 -0.350544
C  -0.0018 0.267004 0.651378
C  4.001073 0.270446 -1.44085
C  1.666442 -0.848897 2.06702
C  -0.508739 0.907706 1.775339
C  -0.463993 0.666244 -0.598472
C  4.895825 1.500333 -1.472188
C  -1.448788 1.919341 1.662467
C  -1.401303 1.675643 -0.727289
C  -0.273106 -3.010126 -1.552151
C  -1.892184 2.298793 0.407926
C  -2.270398 -2.450037 -1.596331
H  1.587194 -1.031814 -1.294286
H  2.691868 -1.780186 -0.167299
H  -0.454189 -2.282663 1.662367
H  0.922061 -3.065616 0.886093
H  3.425703 0.481554 0.619878
H  2.319603 1.235114 -0.506389
H  3.517129 0.144985 -2.414291
H  4.613446 -0.623565 -1.289826
H  -0.170957 0.628855 2.76542
H  -0.102816 0.193403 -1.501978
H  4.316972 2.406709 -1.654737
H  5.647867 1.42609 -2.257382
H  5.420508 1.631662 -0.524898
H  -1.830052 2.408152 2.547884
H  -1.749734 1.971869 -1.706624
H  0.71121 -3.395842 -1.771138
H  -3.279678 -2.293879 -1.942494
totalener: -1261.08499175 hartree
nucrepener: 1639.70841722 hartree
electener: -2900.79340897 hartree
oneelecener: -4976.35226661 hartree
twoeener: 2075.55885764 hartree
kineticenergy: 1256.92890216 hartree
xcener: -100.359522064743 hartree
chargesum: -0.0000000
charge: -0.072785 0.111848 -0.296907 -0.318913 0.025163 0.635308 -0.305858 -0.169864 -0.126654 -0.038908 -0.080334 -0.390110 -0.172336 -0.273335 -0.262668 -0.128499 -0.098347 0.011940 0.089538 0.063703 0.093787 0.105693 0.143015 0.140933 0.084774 0.078089 0.059586 0.057863 0.126295 0.125074 0.076823 0.087438 0.078268 0.123591 0.123338 0.155935 0.137514
qa: -0.0728 0.1118 -0.2969 -0.3189 0.0252 0.6353 -0.3059 -0.1699 -0.1267 -0.0389 -0.0803 -0.3901 -0.1723 -0.2733 -0.2627 -0.1285 -0.0983 0.0119 0.0895 0.0637 0.0938 0.1057 0.1430 0.1409 0.0848 0.0781 0.0596 0.0579 0.1263 0.1251 0.0768 0.0874 0.0783 0.1236 0.1233 0.1559 0.1375
va: 1.2337 3.3089 2.8392 3.0657 3.1276 3.4973 3.9026 3.8967 3.8753 3.6533 3.8737 4.0751 4.0609 4.0197 3.9600 4.0433 4.0385 4.0746 3.9451 4.0255 1.0031 1.0100 1.0132 0.9988 1.0166 1.0135 1.0062 1.0079 1.0182 1.0058 1.0028 1.0053 1.0032 1.0138 1.0114 0.9956 1.0004
dispcorr: -0.019671060 hartree
energy: -1261.104662809016
dipole: 30.03184 -29.39166 0.64018 -6.63627 6.39002 -0.24625 -8.40596 7.78858 -0.61738
magnitude: 0.92284 au
magnitude: 2.34566 debye
