program: Orca
programVersion: 4.2.1
elementType: Cl N N N N C C C C C C C C C C C C C C C H H H H H H H H H H H H H H H H H
charge: 0
multiplicity: 1
keywords: wb97x-d3
keywords: def2-TZVPP
keywords: def2/J RIJCOSX GRIDX6 NOFINALGRIDX
keywords: grid4 nofinalgrid
keywords: scfconv7
keywords: smallprint printgap noloewdin
keywords: NOSOSCF
formula: C15H17ClN4
InChI: InChI=1/C15H17ClN4/c1-2-3-8-15(9-17,10-20-12-18-11-19-20)13-4-6-14(16)7-5-13/h4-7,11-12H,2-3,8,10H2,1H3
37 atoms
Cl -2.962783 3.505455 0.178958
N  -0.704538 -2.481223 -0.577511
N  -1.79436 -2.024873 -1.204933
N  -2.373783 -3.34413 0.51157
N  1.757988 -1.926663 2.192328
C  1.159806 -0.883621 -0.129518
C  2.481036 -0.396353 -0.764983
C  0.601879 -2.051103 -0.984542
C  3.169575 0.725557 -0.002175
C  0.130797 0.230239 -0.014612
C  4.461657 1.171081 -0.676514
C  1.480825 -1.440137 1.187845
C  -0.254081 0.918613 -1.161484
C  -0.467555 0.569861 1.190318
C  5.158474 2.289903 0.083205
C  -1.199408 1.925329 -1.110077
C  -1.420338 1.575936 1.257652
C  -1.071033 -3.265336 0.45113
C  -1.780314 2.251013 0.106119
C  -2.768701 -2.567473 -0.519786
H  2.264316 -0.069518 -1.785879
H  3.158144 -1.251423 -0.856318
H  1.294365 -2.893847 -0.948863
H  0.523888 -1.731723 -2.02236
H  3.388593 0.398819 1.018917
H  2.492689 1.579479 0.08787
H  4.245026 1.501185 -1.697112
H  5.137868 0.316273 -0.771879
H  0.174843 0.671423 -2.124286
H  -0.201804 0.052059 2.102576
H  4.518613 3.169466 0.167264
H  6.077625 2.597732 -0.414748
H  5.420552 1.977392 1.094947
H  -1.489574 2.447882 -2.010677
H  -1.877947 1.82675 2.204279
H  -0.366603 -3.747855 1.111626
H  -3.803435 -2.402359 -0.774955
totalener: -1261.08737957 hartree
nucrepener: 1640.71575436 hartree
electener: -2901.80313393 hartree
oneelecener: -4978.61851224 hartree
twoeener: 2076.81537831 hartree
kineticenergy: 1256.93741064 hartree
xcener: -100.360652498068 hartree
chargesum: 0.0000000
charge: -0.072457 0.115752 -0.301377 -0.325188 0.027190 0.746476 -0.241119 -0.183402 -0.114242 -0.275333 -0.083921 -0.472431 -0.167895 -0.091306 -0.260999 -0.132230 -0.126447 0.043220 0.110102 0.066532 0.091540 0.103674 0.138201 0.127761 0.083327 0.075941 0.058327 0.059303 0.097983 0.130423 0.076849 0.087346 0.078451 0.121028 0.124431 0.151310 0.133181
qa: -0.0725 0.1158 -0.3014 -0.3252 0.0272 0.7465 -0.2411 -0.1834 -0.1142 -0.2753 -0.0839 -0.4724 -0.1679 -0.0913 -0.2610 -0.1322 -0.1264 0.0432 0.1101 0.0665 0.0915 0.1037 0.1382 0.1278 0.0833 0.0759 0.0583 0.0593 0.0980 0.1304 0.0768 0.0873 0.0785 0.1210 0.1244 0.1513 0.1332
va: 1.2338 3.3248 2.8615 3.0695 3.1097 3.3556 3.9103 3.9326 3.8365 3.7870 3.8848 4.0739 4.0253 3.9026 3.9561 4.0890 4.0495 4.0725 3.9179 4.0448 1.0079 1.0133 1.0011 1.0074 1.0145 1.0143 1.0062 1.0079 1.0225 1.0179 1.0030 1.0057 1.0031 1.0135 1.0137 1.0052 1.0011
dispcorr: -0.019479255 hartree
energy: -1261.106858824067
dipole: 33.06178 -31.76371 1.29807 -0.81794 1.31113 0.49319 -5.53394 4.22422 -1.30971
magnitude: 1.90881 au
magnitude: 4.85182 debye
