program: Orca
programVersion: 4.2.1
elementType: Cl O N N N C C C C C C C C C C C C C C C C C H H H H H H H H H H H H H H H H H H H H H H
charge: 0
multiplicity: 1
keywords: wb97x-d3
keywords: def2-TZVPP
keywords: def2/J RIJCOSX GRIDX6 NOFINALGRIDX
keywords: grid4 nofinalgrid
keywords: scfconv7
keywords: smallprint printgap noloewdin
keywords: NOSOSCF
formula: C17H22ClN3O
InChI: InChI=1/C17H22ClN3O/c1-16(2)8-7-14(9-13-3-5-15(18)6-4-13)17(16,22)10-21-12-19-11-20-21/h3-6,11-12,14,22H,7-10H2,1-2H3
44 atoms
Cl 5.281876 1.595715 0.901882
O  -1.630446 -0.76137 1.61806
N  -0.520417 -2.144631 -0.732329
N  -0.575837 -3.030846 0.267728
N  -0.667274 -4.083987 -1.706114
C  -1.657895 -0.190677 0.319668
C  -3.056069 -0.419284 -0.3436
C  -1.582468 1.355024 0.561651
C  -3.901079 0.637079 0.379842
C  -3.022704 1.876989 0.392679
C  -0.460202 -0.71804 -0.480251
C  -0.603896 2.189128 -0.272068
C  -3.661171 -1.807175 -0.149642
C  -3.025876 -0.107022 -1.843362
C  0.862811 2.025478 0.033071
C  -0.580349 -2.786629 -1.895864
C  1.792016 1.927537 -0.999405
C  1.338851 1.99844 1.342511
C  3.150081 1.800166 -0.745957
C  2.691234 1.867105 1.617849
C  -0.667564 -4.173967 -0.36619
C  3.588866 1.766447 0.566965
H  -1.298908 1.470171 1.609499
H  -4.114252 0.306198 1.399603
H  -4.862658 0.797838 -0.112114
H  -3.123251 2.421694 -0.549527
H  -3.28656 2.579088 1.18415
H  0.461168 -0.51983 0.066424
H  -0.373451 -0.235657 -1.451632
H  -0.86697 3.237533 -0.096429
H  -0.772064 2.030553 -1.340424
H  -4.689506 -1.803443 -0.517402
H  -3.140009 -2.589802 -0.702448
H  -3.703858 -2.102722 0.898918
H  -2.520514 -0.884204 -2.418297
H  -4.045999 -0.049668 -2.228094
H  -2.54268 0.840196 -2.085564
H  -1.536852 -1.721174 1.532859
H  -0.537649 -2.281506 -2.847755
H  1.454254 1.945219 -2.028622
H  0.652753 2.080122 2.175852
H  3.851358 1.723807 -1.56572
H  3.035993 1.844046 2.642729
H  -0.730374 -5.110043 0.16582
elementType: Cl O N C H
totalener: -1360.84105592 hartree
nucrepener: 2013.72442102 hartree
electener: -3374.56547695 hartree
oneelecener: -5859.49207293 hartree
twoeener: 2484.92659598 hartree
cpcmener: -0.02996459 hartree
kineticenergy: 1356.15196914 hartree
xcener: -110.266733169630 hartree
chargesum: 0.0000000
charge: -0.107140 -0.465053 0.134637 -0.383929 -0.408207 0.378154 0.233016 -0.035250 -0.239985 -0.159266 -0.237869 -0.133438 -0.370604 -0.391578 -0.000786 0.052969 -0.173196 -0.223187 -0.163939 -0.154176 0.077740 0.104010 0.074161 0.084882 0.082099 0.082737 0.084128 0.151935 0.129627 0.111076 0.101703 0.106424 0.097147 0.098521 0.105498 0.104193 0.107811 0.228603 0.178127 0.142583 0.143390 0.144416 0.144446 0.163573
qa: -0.1071 -0.4651 0.1346 -0.3839 -0.4082 0.3782 0.2330 -0.0353 -0.2400 -0.1593 -0.2379 -0.1334 -0.3706 -0.3916 -0.0008 0.0530 -0.1732 -0.2232 -0.1639 -0.1542 0.0777 0.1040 0.0742 0.0849 0.0821 0.0827 0.0841 0.1519 0.1296 0.1111 0.1017 0.1064 0.0971 0.0985 0.1055 0.1042 0.1078 0.2286 0.1781 0.1426 0.1434 0.1444 0.1444 0.1636
va: 1.1980 1.9769 3.3426 2.8460 3.0205 3.7684 3.7434 3.7642 3.9425 3.9264 3.9704 3.7965 3.9159 3.9421 3.5771 4.0556 3.9449 3.9739 4.0102 3.9927 4.0168 3.8003 1.0546 1.0243 1.0210 1.0046 1.0144 1.0012 0.9846 0.9987 1.0033 1.0038 1.0000 1.0160 1.0010 1.0062 1.0032 1.0498 0.9916 1.0023 1.0066 1.0058 1.0056 0.9948
dispcorr: -0.026480120 hartree
energy: -1360.867536044269
dipole: -37.66396 36.59276 -1.07120 1.18568 0.25405 1.43973 -6.99049 5.72055 -1.26994
magnitude: 2.19842 au
magnitude: 5.58793 debye
