program: Orca
programVersion: 4.2.1
elementType: Cl O N N N C C C C C C C C C C C C C C C C C H H H H H H H H H H H H H H H H H H H H H H
charge: 0
multiplicity: 1
keywords: wb97x-d3
keywords: def2-TZVPP
keywords: def2/J RIJCOSX GRIDX6 NOFINALGRIDX
keywords: grid4 nofinalgrid
keywords: scfconv7
keywords: smallprint printgap noloewdin
keywords: NOSOSCF
formula: C17H22ClN3O
InChI: InChI=1/C17H22ClN3O/c1-16(2)8-7-14(9-13-3-5-15(18)6-4-13)17(16,22)10-21-12-19-11-20-21/h3-6,11-12,14,22H,7-10H2,1-2H3
44 atoms
Cl 4.534111 4.734113 1.02117
O  -1.512196 -1.607749 1.559264
N  -1.514229 -3.395108 -0.708055
N  -2.277312 -3.636569 -1.777584
N  -2.580173 -5.232015 -0.230651
C  -1.266569 -1.094908 0.257964
C  -2.545865 -0.396675 -0.297847
C  -0.237293 0.065106 0.468013
C  -2.509108 0.937085 0.46029
C  -1.05262 1.369814 0.395086
C  -0.671615 -2.22144 -0.599583
C  0.986094 0.095685 -0.4580
C  -3.859458 -1.130531 -0.032643
C  -2.430091 -0.142269 -1.803366
C  1.89483 1.243106 -0.111572
C  -1.706727 -4.352165 0.20038
C  2.022731 2.344474 -0.95129
C  2.612342 1.241932 1.083487
C  2.833437 3.420761 -0.615754
C  3.424463 2.306688 1.43896
C  -2.894435 -4.741068 -1.442248
C  3.525115 3.393019 0.582687
H  0.145045 -0.065389 1.483448
H  -2.818469 0.785357 1.497829
H  -3.193432 1.670319 0.028047
H  -0.858175 1.88912 -0.546845
H  -0.781271 2.065029 1.189225
H  0.266175 -2.548878 -0.149525
H  -0.446461 -1.895104 -1.611665
H  0.678722 0.185691 -1.502534
H  1.551442 -0.834922 -0.373448
H  -4.079053 -1.243917 1.031208
H  -4.685763 -0.548352 -0.445462
H  -3.907518 -2.113276 -0.502066
H  -1.483152 0.312124 -2.098441
H  -2.543814 -1.06174 -2.377624
H  -3.220999 0.539259 -2.122593
H  -2.342189 -2.097488 1.564414
H  -1.176998 -4.39077 1.138781
H  1.482628 2.37107 -1.889621
H  2.542068 0.395425 1.756175
H  2.917832 4.267136 -1.28368
H  3.971988 2.286198 2.371358
H  -3.597355 -5.216248 -2.108357
elementType: Cl O N C H
totalener: -1360.84089095 hartree
nucrepener: 1953.23883114 hartree
electener: -3314.07972209 hartree
oneelecener: -5738.26460636 hartree
twoeener: 2424.18488427 hartree
cpcmener: -0.02980915 hartree
kineticenergy: 1356.15308455 hartree
xcener: -110.262643573237 hartree
chargesum: -0.0000000
charge: -0.107815 -0.447625 0.138517 -0.374979 -0.411932 0.354811 0.214952 -0.056188 -0.220187 -0.191595 -0.199324 -0.080288 -0.369285 -0.392069 -0.011060 0.041258 -0.191795 -0.214180 -0.180119 -0.171800 0.070168 0.115424 0.077885 0.082332 0.085198 0.085235 0.087211 0.145335 0.133094 0.105976 0.106568 0.095046 0.105158 0.115662 0.108255 0.101102 0.100534 0.235259 0.180566 0.141730 0.142576 0.143640 0.144419 0.162329
qa: -0.1078 -0.4476 0.1385 -0.3750 -0.4119 0.3548 0.2150 -0.0562 -0.2202 -0.1916 -0.1993 -0.0803 -0.3693 -0.3921 -0.0111 0.0413 -0.1918 -0.2142 -0.1801 -0.1718 0.0702 0.1154 0.0779 0.0823 0.0852 0.0852 0.0872 0.1453 0.1331 0.1060 0.1066 0.0950 0.1052 0.1157 0.1083 0.1011 0.1005 0.2353 0.1806 0.1417 0.1426 0.1436 0.1444 0.1623
va: 1.1977 2.0092 3.3422 2.8353 3.0349 3.8553 3.7621 3.7384 3.9634 3.9290 3.8640 3.7371 3.9156 3.9282 3.5601 4.0590 3.9513 3.9759 4.0174 4.0030 4.0190 3.7977 1.0523 1.0258 1.0168 1.0057 1.0134 1.0061 1.0012 1.0011 1.0165 1.0080 1.0023 1.0063 1.0011 1.0203 1.0068 1.0171 1.0040 1.0059 1.0051 1.0064 1.0064 0.9950
dispcorr: -0.025473796 hartree
energy: -1360.866364743691
dipole: -26.57134 26.46372 -0.10762 -10.95549 11.30079 0.34530 -6.06769 5.78828 -0.27941
magnitude: 0.45703 au
magnitude: 1.16169 debye
