program: Orca
programVersion: 4.2.1
elementType: Cl O N N N C C C C C C C C C C C C C C C C C H H H H H H H H H H H H H H H H H H H H H H
charge: 0
multiplicity: 1
keywords: wb97x-d3
keywords: def2-TZVPP
keywords: def2/J RIJCOSX GRIDX6 NOFINALGRIDX
keywords: grid4 nofinalgrid
keywords: scfconv7
keywords: smallprint printgap noloewdin
keywords: NOSOSCF
formula: C17H22ClN3O
InChI: InChI=1/C17H22ClN3O/c1-16(2)8-7-14(9-13-3-5-15(18)6-4-13)17(16,22)10-21-12-19-11-20-21/h3-6,11-12,14,22H,7-10H2,1-2H3
44 atoms
Cl 4.558326 4.727947 1.063275
O  -1.5765 -1.509067 1.58678
N  -1.534163 -3.36385 -0.695719
N  -2.118471 -3.986634 0.333315
N  -2.818599 -4.867334 -1.601839
C  -1.2647 -1.081088 0.270978
C  -2.516433 -0.432247 -0.40183
C  -0.258266 0.101399 0.461986
C  -2.533845 0.942825 0.278822
C  -1.07941 1.3907 0.273916
C  -0.631354 -2.247866 -0.497982
C  1.010295 0.085964 -0.40063
C  -3.838259 -1.159953 -0.171814
C  -2.317379 -0.253716 -1.910133
C  1.912283 1.238279 -0.05504
C  -1.964281 -3.897106 -1.836586
C  2.073105 2.317901 -0.917031
C  2.59313 1.261257 1.161067
C  2.884338 3.394621 -0.584452
C  3.406421 2.326208 1.513045
C  -2.878818 -4.873418 -0.260268
C  3.543443 3.389085 0.632721
H  0.071882 0.034409 1.501573
H  -2.900808 0.843871 1.30389
H  -3.19849 1.64305 -0.231609
H  -0.835759 1.864328 -0.68069
H  -0.861459 2.128656 1.04585
H  0.240756 -2.613384 0.046424
H  -0.291678 -1.944398 -1.485547
H  0.757053 0.133623 -1.462754
H  1.560627 -0.845623 -0.249083
H  -4.657922 -0.541772 -0.544298
H  -3.905364 -2.111577 -0.700882
H  -4.036413 -1.34203 0.884456
H  -1.363882 0.20383 -2.176989
H  -2.385136 -1.200498 -2.448319
H  -3.102311 0.389681 -2.312253
H  -2.068052 -2.342047 1.534503
H  -1.622411 -3.567893 -2.80491
H  1.5617 2.325213 -1.871637
H  2.493528 0.431871 1.851238
H  2.997172 4.223484 -1.269976
H  3.927722 2.324091 2.460624
H  -3.499512 -5.552244 0.302753
elementType: Cl O N C H
totalener: -1360.84363562 hartree
nucrepener: 1957.35923271 hartree
electener: -3318.20286833 hartree
oneelecener: -5746.63595987 hartree
twoeener: 2428.43309154 hartree
cpcmener: -0.03108793 hartree
kineticenergy: 1356.15448497 hartree
xcener: -110.266185420946 hartree
chargesum: -0.0000000
charge: -0.107583 -0.467004 0.137153 -0.382595 -0.409031 0.395142 0.230668 -0.052601 -0.238021 -0.182637 -0.221521 -0.087137 -0.370155 -0.391773 -0.011067 0.057520 -0.188982 -0.215633 -0.178874 -0.170156 0.081344 0.112801 0.073985 0.085716 0.083705 0.084457 0.086697 0.143107 0.130941 0.104240 0.106023 0.107149 0.096918 0.096956 0.109767 0.102759 0.103048 0.228938 0.179075 0.141675 0.143370 0.143768 0.144627 0.163224
qa: -0.1076 -0.4670 0.1372 -0.3826 -0.4090 0.3951 0.2307 -0.0526 -0.2380 -0.1826 -0.2215 -0.0871 -0.3702 -0.3918 -0.0111 0.0575 -0.1890 -0.2156 -0.1789 -0.1702 0.0813 0.1128 0.0740 0.0857 0.0837 0.0845 0.0867 0.1431 0.1309 0.1042 0.1060 0.1071 0.0969 0.0970 0.1098 0.1028 0.1030 0.2289 0.1791 0.1417 0.1434 0.1438 0.1446 0.1632
va: 1.1980 1.9815 3.3211 2.8486 3.0178 3.7898 3.7482 3.7020 3.9566 3.9179 3.9358 3.7573 3.9186 3.9488 3.5597 4.0486 3.9504 3.9794 4.0173 4.0026 4.0136 3.8001 1.0581 1.0247 1.0195 1.0067 1.0135 1.0065 0.9841 1.0020 1.0142 1.0036 0.9996 1.0169 1.0025 1.0015 1.0061 1.0517 0.9912 1.0058 1.0047 1.0063 1.0062 0.9949
dispcorr: -0.025554533 hartree
energy: -1360.869190148417
dipole: -26.11819 26.24804 0.12985 -11.41911 11.44430 0.02520 -8.20134 6.82352 -1.37782
magnitude: 1.38416 au
magnitude: 3.51824 debye
