program: Orca
programVersion: 4.2.1
elementType: Cl O N N N C C C C C C C C C C C C C C C C C H H H H H H H H H H H H H H H H H H H H H H
charge: 0
multiplicity: 1
keywords: wb97x-d3
keywords: def2-TZVPP
keywords: def2/J RIJCOSX GRIDX6 NOFINALGRIDX
keywords: grid4 nofinalgrid
keywords: scfconv7
keywords: smallprint printgap noloewdin
keywords: NOSOSCF
formula: C17H22ClN3O
InChI: InChI=1/C17H22ClN3O/c1-16(2)8-7-14(9-13-3-5-15(18)6-4-13)17(16,22)10-21-12-19-11-20-21/h3-6,11-12,14,22H,7-10H2,1-2H3
44 atoms
Cl 4.972452 2.997218 1.453329
O  -2.54081 -1.625726 0.973345
N  -1.016834 -2.771698 -1.083171
N  0.291908 -2.619607 -1.299903
N  -0.125935 -4.652938 -0.466465
C  -2.155201 -0.799429 -0.112154
C  -3.294887 0.255084 -0.319739
C  -0.923562 0.019867 0.330497
C  -2.836462 1.466242 0.53984
C  -1.567523 1.035499 1.277332
C  -1.962569 -1.706879 -1.334031
C  -0.127285 0.708903 -0.789592
C  -4.654156 -0.271129 0.145748
C  -3.452711 0.678225 -1.784551
C  1.150835 1.297141 -0.261207
C  -1.250587 -3.986206 -0.581775
C  1.291397 2.664223 -0.045483
C  2.224962 0.467801 0.058303
C  2.461142 3.19718 0.479235
C  3.400383 0.979086 0.58376
C  0.785185 -3.770739 -0.91843
C  3.50691 2.346039 0.793089
H  -0.221112 -0.637188 0.857607
H  -3.618101 1.794746 1.227322
H  -2.6228 2.322719 -0.105582
H  -0.910574 1.874991 1.51084
H  -1.814851 0.561636 2.228458
H  -1.622947 -1.167653 -2.21501
H  -2.915368 -2.173153 -1.589981
H  -0.715078 1.497801 -1.261217
H  0.120154 -0.011676 -1.569999
H  -5.427434 0.464746 -0.084951
H  -4.93427 -1.197647 -0.362026
H  -4.691067 -0.45285 1.218782
H  -2.524781 1.02493 -2.240401
H  -3.849679 -0.12391 -2.410395
H  -4.162141 1.505681 -1.847537
H  -1.753365 -1.95446 1.419502
H  -2.238197 -4.340162 -0.33098
H  0.476823 3.33493 -0.291895
H  2.14521 -0.599973 -0.110963
H  2.54953 4.26328 0.640172
H  4.222515 0.318637 0.825085
H  1.841365 -3.984419 -0.977006
elementType: Cl O N C H
totalener: -1360.84954895 hartree
nucrepener: 1985.39350590 hartree
electener: -3346.24305485 hartree
oneelecener: -5802.82191178 hartree
twoeener: 2456.57885693 hartree
cpcmener: -0.02480334 hartree
kineticenergy: 1356.13331584 hartree
xcener: -110.257256673951 hartree
chargesum: 0.0000000
charge: -0.105599 -0.414596 0.149120 -0.380519 -0.415502 0.376963 0.097384 0.060551 -0.169064 -0.239033 -0.212029 -0.147525 -0.339837 -0.373425 0.043702 0.044003 -0.249735 -0.241264 -0.135425 -0.160632 0.076154 0.092795 0.080458 0.076483 0.082256 0.095044 0.085418 0.138739 0.134232 0.110242 0.112115 0.102341 0.094166 0.095605 0.110523 0.097526 0.105697 0.214430 0.176657 0.142358 0.146062 0.141771 0.140199 0.161189
qa: -0.1056 -0.4146 0.1491 -0.3805 -0.4155 0.3770 0.0974 0.0606 -0.1691 -0.2390 -0.2120 -0.1475 -0.3398 -0.3734 0.0437 0.0440 -0.2497 -0.2413 -0.1354 -0.1606 0.0762 0.0928 0.0805 0.0765 0.0823 0.0950 0.0854 0.1387 0.1342 0.1102 0.1121 0.1023 0.0942 0.0956 0.1105 0.0975 0.1057 0.2144 0.1767 0.1424 0.1461 0.1418 0.1402 0.1612
va: 1.1998 2.0325 3.3164 2.8473 3.0399 3.8068 3.8152 3.8847 3.8811 4.0375 3.9024 3.7033 3.9532 3.9428 3.5233 4.0732 3.9778 3.9940 3.9809 4.0306 4.0179 3.8204 1.0199 1.0126 1.0047 1.0121 1.0254 0.9931 1.0027 1.0112 1.0380 0.9996 1.0067 1.0120 0.9981 0.9991 1.0021 1.0238 0.9996 1.0042 1.0090 1.0058 1.0078 0.9946
dispcorr: -0.025764797 hartree
energy: -1360.875313746016
dipole: -37.47545 35.75944 -1.71600 -1.73868 2.42059 0.68190 -6.98598 6.38374 -0.60224
magnitude: 1.94226 au
magnitude: 4.93682 debye
