program: Orca
programVersion: 4.2.1
elementType: Cl O N N N C C C C C C C C C C C C C C C C C H H H H H H H H H H H H H H H H H H H H H H
charge: 0
multiplicity: 1
keywords: wb97x-d3
keywords: def2-TZVPP
keywords: def2/J RIJCOSX GRIDX6 NOFINALGRIDX
keywords: grid4 nofinalgrid
keywords: scfconv7
keywords: smallprint printgap noloewdin
keywords: NOSOSCF
formula: C17H22ClN3O
InChI: InChI=1/C17H22ClN3O/c1-16(2)8-7-14(9-13-3-5-15(18)6-4-13)17(16,22)10-21-12-19-11-20-21/h3-6,11-12,14,22H,7-10H2,1-2H3
44 atoms
Cl 4.818769 3.539659 1.227659
O  -2.469378 -1.443105 1.122516
N  -1.100277 -2.976603 -0.729065
N  0.220771 -3.042035 -0.909295
N  -0.501268 -4.852069 0.187451
C  -2.094511 -0.784931 -0.073119
C  -3.270864 0.171462 -0.413617
C  -0.882694 0.152812 0.225036
C  -3.025108 1.311311 0.581577
C  -1.512622 1.522643 0.57086
C  -1.89232 -1.847716 -1.167385
C  0.201997 0.275992 -0.855126
C  -4.646571 -0.461427 -0.226391
C  -3.178197 0.691986 -1.851058
C  1.361586 1.097707 -0.364014
C  -1.516051 -4.061399 -0.071509
C  2.243206 0.567803 0.577475
C  1.581369 2.398408 -0.805044
C  3.30482 1.30732 1.072035
C  2.640577 3.156526 -0.323827
C  0.536429 -4.180129 -0.345858
C  3.493388 2.603373 0.615821
H  -0.376627 -0.247342 1.110292
H  -3.367261 1.01529 1.575843
H  -3.576269 2.215372 0.313227
H  -1.244325 2.260496 -0.189416
H  -1.143648 1.917974 1.5175
H  -1.426704 -1.442632 -2.062998
H  -2.864271 -2.244043 -1.46519
H  -0.203834 0.727662 -1.763016
H  0.570515 -0.712614 -1.130561
H  -4.821699 -0.785699 0.798269
H  -5.42394 0.264631 -0.474457
H  -4.800836 -1.321863 -0.882135
H  -3.380384 -0.090597 -2.58535
H  -3.92824 1.46969 -2.008037
H  -2.212815 1.131633 -2.102582
H  -1.680683 -1.730502 1.593044
H  -2.549472 -4.236534 0.182337
H  2.106202 -0.447463 0.931978
H  0.921592 2.8362 -1.544381
H  3.976453 0.875514 1.801923
H  2.793781 4.165921 -0.681448
H  1.552675 -4.542523 -0.32584
elementType: Cl O N C H
totalener: -1360.85002439 hartree
nucrepener: 1973.65999766 hartree
electener: -3334.51002205 hartree
oneelecener: -5779.34148727 hartree
twoeener: 2444.83146523 hartree
cpcmener: -0.02539514 hartree
kineticenergy: 1356.13772942 hartree
xcener: -110.259189003057 hartree
chargesum: 0.0000000
charge: -0.105880 -0.418662 0.142381 -0.374093 -0.415082 0.366797 0.247530 -0.092565 -0.262152 -0.170098 -0.191850 -0.140038 -0.336724 -0.381300 0.042794 0.049412 -0.227644 -0.209240 -0.165207 -0.162320 0.072211 0.102163 0.082191 0.087115 0.082451 0.084686 0.086324 0.130848 0.147277 0.116617 0.109226 0.093091 0.101239 0.089986 0.099683 0.101400 0.109078 0.213075 0.172760 0.137783 0.139438 0.142097 0.141869 0.161331
qa: -0.1059 -0.4187 0.1424 -0.3741 -0.4151 0.3668 0.2475 -0.0926 -0.2622 -0.1701 -0.1918 -0.1400 -0.3367 -0.3813 0.0428 0.0494 -0.2276 -0.2092 -0.1652 -0.1623 0.0722 0.1022 0.0822 0.0871 0.0825 0.0847 0.0863 0.1308 0.1473 0.1166 0.1092 0.0931 0.1012 0.0900 0.0997 0.1014 0.1091 0.2131 0.1728 0.1378 0.1394 0.1421 0.1419 0.1613
va: 1.1993 2.0387 3.3016 2.8471 3.0318 3.7927 3.7280 3.9376 4.0008 3.9084 3.8386 3.7108 3.9261 3.9433 3.5129 4.0754 3.9905 3.9823 4.0173 4.0089 4.0162 3.8193 1.0234 1.0207 1.0189 1.0056 1.0138 1.0005 0.9964 1.0047 1.0551 1.0200 1.0003 1.0069 0.9983 1.0061 1.0041 1.0244 1.0025 1.0098 1.0067 1.0064 1.0066 0.9937
dispcorr: -0.025289579 hartree
energy: -1360.875313968493
dipole: -35.71395 34.18688 -1.52707 -3.71926 4.33818 0.61892 -8.53872 7.74768 -0.79105
magnitude: 1.82777 au
magnitude: 4.64583 debye
