program: Orca
programVersion: 4.2.1
elementType: Cl O N N N C C C C C C C C C C C C C C C C C H H H H H H H H H H H H H H H H H H H H H H
charge: 0
multiplicity: 1
keywords: wb97x-d3
keywords: def2-TZVPP
keywords: def2/J RIJCOSX GRIDX6 NOFINALGRIDX
keywords: grid4 nofinalgrid
keywords: scfconv7
keywords: smallprint printgap noloewdin
keywords: NOSOSCF
formula: C17H22ClN3O
InChI: InChI=1/C17H22ClN3O/c1-16(2)8-7-14(9-13-3-5-15(18)6-4-13)17(16,22)10-21-12-19-11-20-21/h3-6,11-12,14,22H,7-10H2,1-2H3
44 atoms
Cl 5.291466 1.543838 0.778967
O  -1.690046 -0.741376 1.633576
N  -0.536249 -2.145216 -0.68991
N  -0.672151 -3.018764 0.311331
N  -0.533085 -4.102975 -1.638872
C  -1.684156 -0.183998 0.339843
C  -3.070092 -0.401241 -0.356912
C  -1.602364 1.363369 0.57952
C  -3.921062 0.657183 0.356362
C  -3.037974 1.893557 0.39457
C  -0.473383 -0.719934 -0.437435
C  -0.614405 2.200981 -0.238996
C  -3.688693 -1.785247 -0.177184
C  -3.008887 -0.089337 -1.85623
C  0.85646 2.011255 0.031649
C  -0.450077 -2.811029 -1.846004
C  1.767018 1.998959 -1.020323
C  1.358035 1.881816 1.324403
C  3.12897 1.859158 -0.803937
C  2.715425 1.737986 1.560738
C  -0.670849 -4.179348 -0.303572
C  3.597356 1.726523 0.492074
H  -1.332277 1.465835 1.631984
H  -4.146262 0.318827 1.370126
H  -4.875055 0.82732 -0.147639
H  -3.123816 2.450032 -0.543121
H  -3.314298 2.588802 1.18815
H  0.436721 -0.522468 0.129026
H  -0.366041 -0.234882 -1.40664
H  -0.858417 3.250006 -0.036404
H  -0.802688 2.074783 -1.309635
H  -4.713621 -1.771566 -0.553821
H  -3.164788 -2.567559 -0.726352
H  -3.739302 -2.077751 0.870834
H  -2.477987 -0.863646 -2.412273
H  -4.01864 -0.048759 -2.268933
H  -2.534861 0.865897 -2.086516
H  -1.531318 -1.694229 1.565889
H  -0.323918 -2.322472 -2.800031
H  1.408415 2.101309 -2.038064
H  0.684665 1.882889 2.1718
H  3.818723 1.850954 -1.636587
H  3.084818 1.633355 2.571512
H  -0.769563 -5.109257 0.233715
totalener: -1360.82350175 hartree
nucrepener: 2013.56745110 hartree
electener: -3374.39095284 hartree
oneelecener: -5859.07593631 hartree
twoeener: 2484.68498347 hartree
kineticenergy: 1356.13767495 hartree
xcener: -110.261690250767 hartree
chargesum: -0.0000000
charge: -0.080480 -0.377972 0.130260 -0.345532 -0.323492 0.387664 0.212553 -0.061190 -0.223517 -0.163729 -0.259563 -0.166607 -0.345590 -0.374037 0.015782 0.030855 -0.148810 -0.186892 -0.145816 -0.130131 0.074491 0.097343 0.093377 0.093983 0.073774 0.076145 0.080819 0.160031 0.096483 0.108692 0.082188 0.095864 0.094111 0.098109 0.089094 0.099438 0.095124 0.198921 0.141228 0.111311 0.117639 0.120645 0.123172 0.134263
qa: -0.0805 -0.3780 0.1303 -0.3455 -0.3235 0.3877 0.2126 -0.0612 -0.2235 -0.1637 -0.2596 -0.1666 -0.3456 -0.3740 0.0158 0.0309 -0.1488 -0.1869 -0.1458 -0.1301 0.0745 0.0973 0.0934 0.0940 0.0738 0.0761 0.0808 0.1600 0.0965 0.1087 0.0822 0.0959 0.0941 0.0981 0.0891 0.0994 0.0951 0.1989 0.1412 0.1113 0.1176 0.1206 0.1232 0.1343
va: 1.2258 2.0860 3.3302 2.8567 3.0608 3.8147 3.7806 3.7441 3.9429 3.9272 3.9868 3.8071 3.9309 3.9312 3.6508 4.0775 3.9706 3.9931 4.0530 4.0300 4.0281 3.9161 1.0472 1.0266 1.0219 1.0060 1.0174 0.9964 0.9925 0.9974 1.0042 1.0049 0.9999 1.0209 1.0074 1.0129 1.0046 1.0849 1.0008 1.0094 1.0184 1.0137 1.0121 1.0016
dispcorr: -0.026445011 hartree
energy: -1360.849946757364
dipole: -37.63003 36.95843 -0.67160 1.51615 -0.56843 0.94772 -6.61737 6.00839 -0.60898
magnitude: 1.31152 au
magnitude: 3.33361 debye
