program: Gaussian 09
title: 000073614
version: EM64L-G09RevD.01
frameworkgroup: C1[X(C15H25NO5)]
method: RPBEPBE
basis: SDD
operation: Freq
keyword: #p
keyword: freq=noraman
keyword: PBEPBE/SDD
title: #p freq=noraman PBEPBE/SDD
converged: YES YES NO NO
title: Mulliken charges:
elementType: O O O O O N C C C C C C C C C C C C C C C H H H H H H H H H H H H H H H H H H H H H H H H H
charge: -0.442404 -0.283931 -0.460590 -0.471863 -0.228655 -0.112014 -0.315079 -0.123943 -0.403270 -0.456354 0.322449 -0.419545 -0.395033 -0.347746 0.215063 -0.111706 -0.115047 0.203151 -0.737569 -0.730604 -0.728177 0.247278 0.242669 0.179198 0.234227 0.219502 0.251290 0.232060 0.197364 0.260479 0.272313 0.243049 0.348875 0.235453 0.223461 0.247779 0.214868 0.206213 0.208508 0.211723 0.263097 0.200509 0.225128 0.262932 0.369211 0.345680
chargesum: 0.00000
title: Mulliken charges with hydrogens summed into heavy atoms:
elementType: O O O O O N C C C C C C C C C C C C C C C
charge: -0.093529 -0.283931 -0.091378 -0.126183 -0.228655 -0.112014 -0.067802 0.118726 0.010154 0.014439 0.322449 0.009879 -0.134554 0.167616 0.215063 0.123747 0.108414 0.203151 -0.068709 -0.047276 -0.039608
polarizability: 2.07347033e+02 -1.92689568e+00 1.68777971e+02 5.56999847e-01 1.39304039e+01 1.65089018e+02
1716.lowfreq: -22.9221 -18.6218 -6.8083 -0.0004 0.0003 0.0006 1.7096 14.8048 39.2807
frequency: -17.7642 11.2237 39.2723 46.4702 57.1339 66.0717 91.8234 109.7244 124.2371 157.6002 164.5123 175.2206 192.2515 204.4760 208.9649 215.8045 221.9303 229.6406 240.3251 248.4590 255.5474 276.1015 302.2230 309.3611 326.8010 330.9447 376.2476 383.0620 394.9251 397.2885 433.2117 447.6385 487.4759 505.4156 538.4387 582.3867 616.1245 643.9395 692.1770 701.0394 722.8811 772.7542 802.2944 815.1392 834.9943 845.1304 861.0006 879.2115 899.5556 906.2959 923.9379 939.6555 953.6489 957.7524 965.0937 978.3935 991.3425 994.6831 1001.7525 1006.3115 1033.8679 1060.9270 1070.6783 1071.8868 1103.1559 1106.9162 1115.2762 1124.1568 1147.1450 1154.0462 1158.3941 1174.7240 1177.0109 1187.6437 1189.7911 1205.0279 1206.3151 1217.7526 1233.5508 1250.3842 1267.5813 1293.2534 1301.4063 1311.0124 1314.2927 1322.2224 1329.2003 1340.7739 1346.5005 1354.5493 1372.2488 1375.0299 1377.0973 1386.5511 1395.7792 1446.4442 1461.0002 1463.8963 1468.2387 1475.7841 1478.3011 1481.5885 1481.8619 1494.9373 1507.8967 1630.7211 1679.5727 2874.9312 2919.7674 2933.5214 2964.0648 2977.6433 2981.2694 2983.9852 2985.7976 2991.6821 3000.4467 3010.5967 3027.1576 3039.7512 3067.9057 3069.1271 3071.3689 3077.1804 3091.7398 3097.4900 3101.7695 3105.2307 3182.7572 3532.3139 3541.1978 3581.0018
redmass: 4.2352 4.3447 3.8026 3.4353 4.9940 3.6870 3.4517 4.9770 3.1153 3.5715 2.8736 2.0381 2.5914 3.1953 2.3614 1.1010 1.6183 1.2581 1.1840 1.5064 1.4833 2.3691 3.0203 3.4025 2.5389 3.1259 2.7674 2.5109 3.8985 3.3485 3.2442 2.9354 3.9872 4.0514 4.0479 4.1991 5.3470 3.8915 4.1199 3.9400 2.8669 2.7756 3.6091 2.3402 1.6880 3.0555 3.7211 2.6653 2.0229 5.0686 1.1765 2.5691 1.4734 2.4221 2.4365 1.9398 1.7735 2.0183 2.2683 2.2042 1.8369 3.0350 2.6014 2.0166 2.3281 2.0911 2.7172 2.2321 2.2780 1.3091 1.3489 2.2940 1.4713 2.3020 2.0050 1.4168 1.2227 1.4462 1.3679 1.4019 1.4951 1.4111 1.6021 1.2917 1.3803 1.4950 1.4507 1.4645 1.4426 1.5302 1.1836 1.5318 1.3519 1.2361 1.2079 1.0932 1.0495 1.0733 1.0506 1.0464 1.0549 1.0717 1.0615 1.0535 1.0836 11.4868 7.5939 1.0725 1.0652 1.0838 1.0956 1.0386 1.0394 1.0373 1.0574 1.0811 1.0826 1.0695 1.0833 1.1038 1.0985 1.0970 1.0982 1.0890 1.0990 1.1012 1.0992 1.0994 1.0962 1.0657 1.0647 1.0665
irintensity: 0.0415 0.6892 2.1855 5.6542 1.8246 2.6998 1.0058 0.5656 9.6920 3.5473 0.9456 90.9602 6.1530 1.1128 58.8870 8.0017 1.0831 13.8318 23.9800 157.2309 39.3935 4.1857 27.7082 16.7831 20.7236 26.0017 42.5932 2.0126 9.4412 10.6401 6.8575 15.5996 12.4927 8.2113 1.3089 11.0819 8.0076 17.9870 0.2403 0.5328 0.7857 6.6247 9.3039 30.7286 14.6880 26.8656 14.3040 2.2569 5.7647 7.9831 1.8697 8.1619 8.1670 45.7779 9.4391 34.0437 1.1194 27.3731 101.2759 6.5625 20.0292 24.2229 23.4939 53.8275 53.9802 40.3557 148.4227 30.8597 13.3791 3.3074 13.4007 159.9727 81.7635 6.3066 4.9190 5.0606 7.3611 11.3791 4.9475 3.7650 1.4319 13.9018 4.4375 0.6513 5.5776 4.3263 36.8296 2.9150 17.7338 10.2195 20.9369 4.6157 16.6826 34.2640 10.4447 12.2408 6.3691 20.7015 4.3485 0.6665 9.6713 8.8054 2.6422 16.2156 6.0122 177.1919 2.1719 91.3840 87.6111 30.5723 47.4208 23.5586 29.4799 21.8621 9.6835 17.9835 43.2845 13.8694 77.7888 5.3519 19.9776 62.8410 31.8941 37.2132 36.0100 19.9891 12.8099 14.6682 9.0372 4.4439 21.8454 4.2703
temp: 298.150 k
press: 1.00000 atm
elementType: 8 8 8 8 8 7 6 6 6 6 6 6 6 6 6 6 6 6 6 6 6 1 1 1 1 1 1 1 1 1 1 1 1 1 1 1 1 1 1 1 1 1 1 1 1 1
symmnumber: 1
zpe: 1006139.6 jmol-1
zpe.correction: 0.383218 hartree
zpe.thermalcorrener: 0.405976 hartree
zpe.thermalcorrenthalpy: 0.406921 hartree
zpe.thermalcorrgfe: 0.330922 hartree
zpe.sumelectzpe: -1015.751631 hartree
zpe.sumelectthermal: -1015.728873 hartree
zpe.sumelectthermalent: -1015.727929 hartree
zpe.sumelectthermalfe: -1015.803927 hartree
dipole: 1.6043 4.1471 1.8934
dipole: 4.8329
quadrupole: -123.6918 -130.0551 -123.1193
quadrupole: -10.5495 -2.8772 -1.2530
quadrupole: 1.9302 -4.4330 2.5028 -10.5495 -2.8772 -1.2530
hfenergy: -1016.1348492 hartree
pointgroup: C01 [X(C15H25N1O5)]
dipole: 0.7582108 1.1935737 1.2711709 debye
polarizability: 206.7032253|-5.7385793|159.53456|0.1364726|11.6029236|174.9762359 unknown
InChI: InChI=1S/C15H25NO5/c1-9(2)15(20,10(3)17)14(19)21-8-11-4-6-16-7-5-12(18)13(11)16/h4,9-10,12-13,17-18,20H,5-8H2,1-3H3
charge 0 multiplicity 1
46 atoms
O  2.961279 -2.263517 -0.287878
O  -0.726311 -0.010489 -0.256763
O  -4.337934 -0.324582 -0.884908
O  -3.018531 2.150645 -1.070376
O  -1.930328 -0.704826 -2.12216
N  3.954313 0.78994 0.353655
C  3.102634 0.22198 -0.755562
C  3.67245 -1.209832 -1.033547
C  5.055673 -0.16233 0.673252
C  5.144995 -1.069952 -0.578336
C  1.68058 0.286599 -0.205987
C  3.075629 1.229949 1.47633
C  1.67276 0.836611 1.036048
C  0.529678 -0.198004 -1.033575
C  -3.159735 -0.008927 -0.07818
C  -3.268568 -0.942917 1.17205
C  -3.158003 1.51385 0.261963
C  -1.904748 -0.291465 -0.943335
C  -2.336802 -0.578379 2.350648
C  -3.083765 -2.422723 0.759714
C  -4.437777 1.982232 0.965447
H  3.199772 0.824434 -1.683998
H  3.57437 -1.511771 -2.088192
H  4.823442 -0.773245 1.58042
H  6.006342 0.365908 0.868802
H  5.732625 -0.571642 -1.371588
H  5.593778 -2.054558 -0.370245
H  3.146949 2.323856 1.650935
H  3.367984 0.736265 2.431262
H  0.7782 1.015667 1.637349
H  0.639078 -1.270896 -1.282077
H  0.441023 0.359781 -1.986421
H  2.740895 -1.923959 0.618357
H  -4.319702 -0.818228 1.502457
H  -2.26091 1.746023 0.868788
H  -1.275842 -0.645056 2.054408
H  -2.507882 -1.290114 3.17903
H  -2.523289 0.437675 2.744021
H  -3.352706 -3.088957 1.59945
H  -2.031856 -2.6347 0.488175
H  -3.725255 -2.668128 -0.10267
H  -4.438778 3.083913 1.075618
H  -4.525844 1.551478 1.978922
H  -5.319883 1.678472 0.377467
H  -4.160152 -0.017182 -1.812345
H  -3.091648 3.132502 -0.975525
