program: Orca
programVersion: 4.2.1
elementType: Cl O N N N C C C C C C C C C C C C C C C C C H H H H H H H H H H H H H H H H H H H H H H
charge: 0
multiplicity: 1
keywords: wb97x-d3
keywords: def2-TZVPP
keywords: def2/J RIJCOSX GRIDX6 NOFINALGRIDX
keywords: grid4 nofinalgrid
keywords: scfconv7
keywords: smallprint printgap noloewdin
keywords: NOSOSCF
formula: C17H22ClN3O
InChI: InChI=1/C17H22ClN3O/c1-16(2)8-7-14(9-13-3-5-15(18)6-4-13)17(16,22)10-21-12-19-11-20-21/h3-6,11-12,14,22H,7-10H2,1-2H3
44 atoms
Cl 5.006753 2.995497 1.380611
O  -2.540479 -1.619447 0.966118
N  -1.027019 -2.778817 -1.067653
N  0.296835 -2.6119 -1.143471
N  -0.18484 -4.679396 -0.427667
C  -2.150692 -0.795378 -0.115884
C  -3.295711 0.250598 -0.318121
C  -0.921808 0.030656 0.324804
C  -2.863547 1.442385 0.58232
C  -1.565572 1.033099 1.284761
C  -1.948721 -1.701204 -1.338207
C  -0.12943 0.730238 -0.792134
C  -4.659897 -0.298351 0.10623
C  -3.428888 0.708367 -1.77596
C  1.154226 1.313625 -0.271553
C  -1.295981 -4.016745 -0.632037
C  1.291532 2.67401 -0.022724
C  2.240937 0.484314 -0.004174
C  2.470163 3.201013 0.484666
C  3.424986 0.991839 0.502598
C  0.759722 -3.776811 -0.754485
C  3.531512 2.352585 0.747277
H  -0.209007 -0.62323 0.841667
H  -3.643369 1.707072 1.297821
H  -2.700472 2.33367 -0.029266
H  -0.915478 1.881474 1.501528
H  -1.782715 0.555207 2.240261
H  -1.586308 -1.160766 -2.209806
H  -2.904717 -2.153715 -1.609184
H  -0.720749 1.524814 -1.25105
H  0.114161 0.015583 -1.579321
H  -5.42941 0.448159 -0.099735
H  -4.931155 -1.200178 -0.447481
H  -4.702975 -0.534581 1.166813
H  -2.496661 1.073999 -2.205682
H  -3.806067 -0.082966 -2.426823
H  -4.146806 1.52794 -1.832383
H  -1.756573 -2.010906 1.362191
H  -2.300127 -4.384737 -0.489254
H  0.465416 3.343207 -0.232832
H  2.158539 -0.577328 -0.20634
H  2.561202 4.262121 0.671337
H  4.261954 0.336866 0.701982
H  1.817806 -3.982754 -0.711947
totalener: -1360.82213411 hartree
nucrepener: 1985.57989809 hartree
electener: -3346.40203219 hartree
oneelecener: -5803.20888342 hartree
twoeener: 2456.80685123 hartree
kineticenergy: 1356.14610782 hartree
xcener: -110.256711397681 hartree
chargesum: 0.0000000
charge: -0.086286 -0.358028 0.144071 -0.355184 -0.328862 0.398445 0.084405 0.038860 -0.179869 -0.216877 -0.244410 -0.168724 -0.301977 -0.363477 0.048328 0.017815 -0.231711 -0.205750 -0.118125 -0.136036 0.078956 0.088368 0.069252 0.076342 0.077696 0.094528 0.085187 0.133554 0.117401 0.097946 0.114531 0.095126 0.079529 0.104312 0.107290 0.090572 0.101559 0.181926 0.151036 0.117587 0.131534 0.118837 0.118427 0.131894
qa: -0.0863 -0.3580 0.1441 -0.3552 -0.3289 0.3984 0.0844 0.0389 -0.1799 -0.2169 -0.2444 -0.1687 -0.3020 -0.3635 0.0483 0.0178 -0.2317 -0.2058 -0.1181 -0.1360 0.0790 0.0884 0.0693 0.0763 0.0777 0.0945 0.0852 0.1336 0.1174 0.0979 0.1145 0.0951 0.0795 0.1043 0.1073 0.0906 0.1016 0.1819 0.1510 0.1176 0.1315 0.1188 0.1184 0.1319
va: 1.2205 2.0887 3.2882 2.8249 3.0693 3.7292 3.8502 3.9075 3.8959 4.0224 3.9419 3.7388 3.9614 3.9410 3.6123 4.0950 4.0013 4.0109 4.0201 4.0425 4.0251 3.9170 1.0220 1.0153 1.0053 1.0146 1.0295 0.9941 1.0059 1.0132 1.0333 0.9997 1.0102 1.0141 0.9997 1.0014 1.0061 1.0538 1.0044 1.0088 1.0151 1.0129 1.0145 1.0013
dispcorr: -0.025746568 hartree
energy: -1360.847880674387
dipole: -37.54254 36.25725 -1.28529 -1.76771 2.21038 0.44267 -6.93196 6.46564 -0.46632
magnitude: 1.43714 au
magnitude: 3.65293 debye
