program: Orca
programVersion: 4.2.1
elementType: Cl O N N N C C C C C C C C C C C C C C C C C H H H H H H H H H H H H H H H H H H H H H H
charge: 0
multiplicity: 1
keywords: wb97x-d3
keywords: def2-TZVPP
keywords: def2/J RIJCOSX GRIDX6 NOFINALGRIDX
keywords: grid4 nofinalgrid
keywords: scfconv7
keywords: smallprint printgap noloewdin
keywords: NOSOSCF
formula: C17H22ClN3O
InChI: InChI=1/C17H22ClN3O/c1-16(2)8-7-14(9-13-3-5-15(18)6-4-13)17(16,22)10-21-12-19-11-20-21/h3-6,11-12,14,22H,7-10H2,1-2H3
44 atoms
Cl 5.007762 2.60631 1.751427
O  -2.31988 -0.410293 -1.860329
N  -1.133309 -2.709805 -0.571102
N  -0.039768 -2.888067 0.176152
N  0.314595 -3.625399 -1.911881
C  -2.313468 -0.522692 -0.451529
C  -3.540789 0.214886 0.166555
C  -1.088889 0.273163 0.071717
C  -3.10027 1.676108 0.041894
C  -1.629466 1.672629 0.452164
C  -2.290304 -2.006423 -0.064471
C  0.091561 0.353655 -0.906592
C  -3.726557 -0.140277 1.645644
C  -4.85095 -0.059603 -0.564331
C  1.318882 0.923801 -0.250858
C  -0.903507 -3.144874 -1.808755
C  1.730238 2.231332 -0.490167
C  2.076003 0.149215 0.627178
C  2.859103 2.759658 0.121898
C  3.20724 0.655734 1.246635
C  0.79555 -3.435889 -0.669668
C  3.589543 1.963226 0.986801
H  -0.733017 -0.229084 0.975643
H  -3.712643 2.342193 0.653016
H  -3.20465 2.008045 -0.993712
H  -1.07493 2.473929 -0.038366
H  -1.524942 1.842907 1.524522
H  -3.181547 -2.510828 -0.444729
H  -2.283886 -2.135711 1.014171
H  -0.178893 0.974659 -1.762192
H  0.33888 -0.631372 -1.305928
H  -4.119224 -1.149397 1.781434
H  -2.805815 -0.064842 2.226598
H  -4.44854 0.542076 2.097797
H  -5.111633 -1.12092 -0.565973
H  -5.669672 0.465007 -0.068785
H  -4.840727 0.290094 -1.598021
H  -3.12152 -0.820523 -2.204218
H  -1.644538 -3.119361 -2.590973
H  1.167863 2.855859 -1.173484
H  1.781682 -0.874266 0.828412
H  3.161796 3.777996 -0.080821
H  3.784358 0.035435 1.918782
H  1.79265 -3.720735 -0.372256
elementType: Cl O N C H
totalener: -1360.84480513 hartree
nucrepener: 1996.94417997 hartree
electener: -3357.78898510 hartree
oneelecener: -5826.55739472 hartree
twoeener: 2468.76840962 hartree
cpcmener: -0.03287336 hartree
kineticenergy: 1356.15574172 hartree
xcener: -110.262881952932 hartree
chargesum: -0.0000000
charge: -0.108820 -0.425015 0.125282 -0.367244 -0.414640 0.337729 0.243044 -0.061518 -0.239510 -0.190252 -0.174794 -0.133179 -0.374919 -0.342218 0.074097 0.063233 -0.221850 -0.251844 -0.156870 -0.170964 0.063280 0.099620 0.086403 0.084852 0.082269 0.078166 0.099848 0.140176 0.118112 0.101271 0.108160 0.100205 0.106303 0.100050 0.108782 0.101631 0.089075 0.215068 0.165640 0.143338 0.149257 0.144303 0.142218 0.162225
qa: -0.1088 -0.4250 0.1253 -0.3672 -0.4146 0.3377 0.2430 -0.0615 -0.2395 -0.1903 -0.1748 -0.1332 -0.3749 -0.3422 0.0741 0.0632 -0.2218 -0.2518 -0.1569 -0.1710 0.0633 0.0996 0.0864 0.0849 0.0823 0.0782 0.0998 0.1402 0.1181 0.1013 0.1082 0.1002 0.1063 0.1001 0.1088 0.1016 0.0891 0.2151 0.1656 0.1433 0.1493 0.1443 0.1422 0.1622
va: 1.1963 2.0286 3.3516 2.8332 3.0285 3.8853 3.7576 3.7467 3.9624 3.9287 3.9206 3.7923 3.9582 3.9224 3.4372 4.0690 3.9988 3.9864 3.9930 4.0484 4.0202 3.8007 1.0271 1.0188 1.0255 1.0198 1.0006 0.9951 1.0118 1.0269 1.0139 0.9974 0.9963 1.0055 1.0003 1.0012 1.0124 1.0189 1.0052 1.0047 1.0102 1.0055 1.0079 0.9970
dispcorr: -0.026045669 hartree
energy: -1360.870850804002
dipole: -40.13157 36.79152 -3.34005 -2.44177 2.48450 0.04273 -2.66106 2.73983 0.07877
magnitude: 3.34125 au
magnitude: 8.49278 debye
