program: Orca
programVersion: 4.2.1
elementType: Cl O N N N C C C C C C C C C C C C C C C C C H H H H H H H H H H H H H H H H H H H H H H
charge: 0
multiplicity: 1
keywords: wb97x-d3
keywords: def2-TZVPP
keywords: def2/J RIJCOSX GRIDX6 NOFINALGRIDX
keywords: grid4 nofinalgrid
keywords: scfconv7
keywords: smallprint printgap noloewdin
keywords: NOSOSCF
formula: C17H22ClN3O
InChI: InChI=1/C17H22ClN3O/c1-16(2)8-7-14(9-13-3-5-15(18)6-4-13)17(16,22)10-21-12-19-11-20-21/h3-6,11-12,14,22H,7-10H2,1-2H3
44 atoms
Cl 5.013452 2.846669 1.334066
O  -2.349418 -0.808961 -1.791913
N  -1.120263 -2.749812 -0.137312
N  -0.036303 -2.79344 0.643306
N  0.337939 -3.896697 -1.272591
C  -2.309644 -0.582033 -0.396126
C  -3.551299 0.238486 0.069323
C  -1.094708 0.30419 0.01363
C  -3.112208 1.664256 -0.284201
C  -1.651897 1.741148 0.158153
C  -2.285637 -1.974911 0.228426
C  0.091615 0.234101 -0.95766
C  -3.763699 0.135561 1.583721
C  -4.843666 -0.159724 -0.632795
C  1.317386 0.896558 -0.392274
C  -0.879088 -3.40291 -1.272682
C  2.054762 0.273259 0.613714
C  1.749628 2.138497 -0.846687
C  3.187467 0.863367 1.150481
C  2.881366 2.748376 -0.321429
C  0.80606 -3.486816 -0.079537
C  3.592005 2.101906 0.674953
H  -0.741688 -0.040463 0.989281
H  -3.744117 2.417651 0.189675
H  -3.19674 1.832912 -1.363658
H  -1.088988 2.461314 -0.437816
H  -1.580769 2.078638 1.192706
H  -3.170583 -2.538598 -0.071726
H  -2.288589 -1.914278 1.312744
H  -0.168112 0.717481 -1.902363
H  0.335742 -0.801605 -1.199278
H  -4.166464 -0.835811 1.875519
H  -2.853873 0.300368 2.16381
H  -4.488697 0.886437 1.902953
H  -5.105667 -1.20473 -0.452373
H  -5.671463 0.445146 -0.25727
H  -4.799414 -0.008827 -1.711219
H  -2.376513 0.033931 -2.257344
H  -1.610732 -3.51598 -2.055685
H  1.743369 -0.696839 0.982894
H  1.202303 2.643651 -1.633223
H  3.748789 0.359872 1.925887
H  3.20116 3.712789 -0.691934
H  1.798456 -3.715343 0.276461
elementType: Cl O N C H
totalener: -1360.84396321 hartree
nucrepener: 1996.08875916 hartree
electener: -3356.93272237 hartree
oneelecener: -5824.58522256 hartree
twoeener: 2467.65250019 hartree
cpcmener: -0.03013390 hartree
kineticenergy: 1356.15288210 hartree
xcener: -110.262333465504 hartree
chargesum: 0.0000000
charge: -0.108819 -0.438484 0.117562 -0.369806 -0.414967 0.388479 0.237582 -0.118149 -0.261583 -0.166168 -0.163784 -0.128511 -0.374761 -0.325808 0.077077 0.067528 -0.252625 -0.225997 -0.169073 -0.151314 0.064957 0.095581 0.082235 0.083854 0.082901 0.079585 0.101334 0.138930 0.124971 0.103926 0.108476 0.099496 0.105629 0.100256 0.093117 0.103633 0.088052 0.216437 0.166903 0.149550 0.142959 0.142361 0.144145 0.162336
qa: -0.1088 -0.4385 0.1176 -0.3698 -0.4150 0.3885 0.2376 -0.1181 -0.2616 -0.1662 -0.1638 -0.1285 -0.3748 -0.3258 0.0771 0.0675 -0.2526 -0.2260 -0.1691 -0.1513 0.0650 0.0956 0.0822 0.0839 0.0829 0.0796 0.1013 0.1389 0.1250 0.1039 0.1085 0.0995 0.1056 0.1003 0.0931 0.1036 0.0881 0.2164 0.1669 0.1495 0.1430 0.1424 0.1441 0.1623
va: 1.1958 2.0120 3.3564 2.8319 3.0292 3.8197 3.7377 3.8753 3.9811 3.8974 3.8781 3.7947 3.9568 3.9408 3.4585 4.0583 3.9897 4.0033 4.0482 3.9885 4.0193 3.8001 1.0270 1.0193 1.0129 1.0219 1.0002 0.9997 1.0114 1.0181 1.0132 0.9977 0.9965 1.0058 1.0043 1.0010 1.0165 1.0247 1.0082 1.0111 1.0049 1.0076 1.0055 0.9967
dispcorr: -0.026042749 hartree
energy: -1360.870005956892
dipole: -39.59910 36.90347 -2.69563 -1.62436 2.70660 1.08224 -2.86855 2.77895 -0.08960
magnitude: 2.90615 au
magnitude: 7.38684 debye
