program: Orca
programVersion: 4.2.1
elementType: Cl O N N N C C C C C C C C C C C C C C C C C H H H H H H H H H H H H H H H H H H H H H H
charge: 0
multiplicity: 1
keywords: wb97x-d3
keywords: def2-TZVPP
keywords: def2/J RIJCOSX GRIDX6 NOFINALGRIDX
keywords: grid4 nofinalgrid
keywords: scfconv7
keywords: smallprint printgap noloewdin
keywords: NOSOSCF
formula: C17H22ClN3O
InChI: InChI=1/C17H22ClN3O/c1-16(2)8-7-14(9-13-3-5-15(18)6-4-13)17(16,22)10-21-12-19-11-20-21/h3-6,11-12,14,22H,7-10H2,1-2H3
44 atoms
Cl 4.944567 4.008862 1.775963
O  -1.521086 -0.577172 -1.858973
N  -1.670426 -3.265641 -0.653162
N  -2.126428 -3.337504 -1.908226
N  -3.041662 -4.953448 -0.658826
C  -1.344978 -0.800525 -0.474793
C  -2.648842 -0.448206 0.305231
C  -0.333796 0.2485 0.034722
C  -2.637934 1.085323 0.209994
C  -1.169232 1.510133 0.335158
C  -0.779538 -2.20425 -0.233172
C  0.847917 0.500059 -0.906161
C  -2.565464 -0.86973 1.7750
C  -3.935631 -1.013916 -0.28958
C  1.883396 1.377651 -0.26128
C  -2.229399 -4.227645 0.076272
C  1.976749 2.732867 -0.563552
C  2.763234 0.855317 0.68528
C  2.911811 3.550064 0.05709
C  3.705969 1.652462 1.314807
C  -2.944614 -4.359895 -1.859698
C  3.769591 3.000072 0.994502
H  0.076237 -0.130615 0.976321
H  -3.276371 1.535783 0.97276
H  -3.039346 1.395119 -0.757432
H  -0.936287 2.318755 -0.360429
H  -0.943795 1.889833 1.332424
H  -0.567501 -2.364928 0.821604
H  0.164511 -2.319323 -0.768852
H  0.497201 0.966286 -1.827593
H  1.313422 -0.448495 -1.188743
H  -3.431408 -0.483897 2.316296
H  -2.578727 -1.95434 1.898883
H  -1.676956 -0.490772 2.282517
H  -4.025795 -0.814749 -1.35751
H  -4.044705 -2.088125 -0.130445
H  -4.794257 -0.541783 0.193184
H  -1.954557 -1.352949 -2.244763
H  -2.01007 -4.374646 1.121862
H  1.313851 3.166932 -1.302054
H  2.719464 -0.197952 0.936638
H  2.967737 4.600771 -0.19315
H  4.381989 1.22577 2.043289
H  -3.487451 -4.690027 -2.731094
elementType: Cl O N C H
totalener: -1360.84651796 hartree
nucrepener: 1953.75349873 hartree
electener: -3314.60001669 hartree
oneelecener: -5739.64003444 hartree
twoeener: 2425.04001775 hartree
cpcmener: -0.02980929 hartree
kineticenergy: 1356.15648809 hartree
xcener: -110.266226601699 hartree
chargesum: -0.0000000
charge: -0.108345 -0.474336 0.135895 -0.380809 -0.410021 0.352328 0.279006 -0.023022 -0.247673 -0.217259 -0.217253 -0.119202 -0.368884 -0.371775 0.043173 0.055114 -0.212386 -0.226664 -0.160575 -0.159939 0.084444 0.095274 0.095843 0.083841 0.087774 0.081568 0.097898 0.121737 0.146049 0.088894 0.102236 0.100799 0.097448 0.108693 0.093784 0.095343 0.108812 0.222952 0.178092 0.144073 0.143554 0.144795 0.145005 0.163719
qa: -0.1083 -0.4743 0.1359 -0.3808 -0.4100 0.3523 0.2790 -0.0230 -0.2477 -0.2173 -0.2173 -0.1192 -0.3689 -0.3718 0.0432 0.0551 -0.2124 -0.2267 -0.1606 -0.1599 0.0844 0.0953 0.0958 0.0838 0.0878 0.0816 0.0979 0.1217 0.1460 0.0889 0.1022 0.1008 0.0974 0.1087 0.0938 0.0953 0.1088 0.2230 0.1781 0.1441 0.1436 0.1448 0.1450 0.1637
va: 1.1972 1.9820 3.3106 2.8539 3.0163 3.8352 3.7086 3.7098 3.9762 3.9383 3.9824 3.8312 3.9598 3.9211 3.5134 4.0480 3.9732 3.9877 3.9924 3.9922 4.0100 3.8128 1.0117 1.0189 1.0187 1.0134 1.0033 0.9932 0.9952 1.0269 1.0193 1.0056 1.0010 0.9993 1.0191 1.0001 1.0039 1.0607 0.9921 1.0043 1.0036 1.0053 1.0051 0.9944
dispcorr: -0.025290423 hartree
energy: -1360.871808378758
dipole: -28.51808 28.39544 -0.12264 -10.10103 9.64870 -0.45234 -0.79756 1.80142 1.00386
magnitude: 1.10788 au
magnitude: 2.81600 debye
