program: Orca
programVersion: 4.2.1
elementType: Cl O N N N C C C C C C C C C C C C C C C C C H H H H H H H H H H H H H H H H H H H H H H
charge: 0
multiplicity: 1
keywords: wb97x-d3
keywords: def2-TZVPP
keywords: def2/J RIJCOSX GRIDX6 NOFINALGRIDX
keywords: grid4 nofinalgrid
keywords: scfconv7
keywords: smallprint printgap noloewdin
keywords: NOSOSCF
formula: C17H22ClN3O
InChI: InChI=1/C17H22ClN3O/c1-16(2)8-7-14(9-13-3-5-15(18)6-4-13)17(16,22)10-21-12-19-11-20-21/h3-6,11-12,14,22H,7-10H2,1-2H3
44 atoms
Cl 4.940415 2.524021 2.007659
O  -2.422124 -0.31356 -1.917377
N  -1.126877 -2.674597 -0.708081
N  -0.898476 -2.768194 -2.022774
N  0.829735 -3.609718 -0.872852
C  -2.312673 -0.498201 -0.520663
C  -3.535912 0.21433 0.1248
C  -1.086264 0.26764 0.060178
C  -3.094893 1.679624 0.056458
C  -1.62311 1.661017 0.466844
C  -2.294013 -1.994659 -0.186175
C  0.116161 0.370181 -0.888496
C  -3.712039 -0.190595 1.592765
C  -4.850313 -0.033928 -0.604823
C  1.329288 0.915785 -0.188046
C  -0.08635 -3.167796 -0.04038
C  1.726009 2.241078 -0.337198
C  2.08226 0.098353 0.65338
C  2.832254 2.745627 0.33339
C  3.19122 0.580033 1.329953
C  0.285573 -3.329924 -2.068527
C  3.555756 1.907606 1.164429
H  -0.755053 -0.263466 0.959103
H  -3.706352 2.319765 0.695754
H  -3.202339 2.054688 -0.963884
H  -1.067023 2.469134 -0.010787
H  -1.515625 1.812942 1.541763
H  -3.182428 -2.488923 -0.581845
H  -2.278775 -2.151845 0.88935
H  -0.136787 1.012183 -1.734376
H  0.378278 -0.602798 -1.308998
H  -4.102469 -1.204391 1.697007
H  -2.790035 -0.131745 2.173707
H  -4.433663 0.474798 2.069806
H  -4.828008 0.31322 -1.636532
H  -5.123048 -1.092119 -0.610112
H  -5.658465 0.499192 -0.098963
H  -1.804514 -0.908723 -2.364783
H  -0.045626 -3.204153 1.036719
H  1.170067 2.899023 -0.993592
H  1.806086 -0.941569 0.783963
H  3.123208 3.778826 0.201667
H  3.762837 -0.073901 1.974244
H  0.767895 -3.554132 -3.006756
elementType: Cl O N C H
totalener: -1360.84556972 hartree
nucrepener: 1997.71689672 hartree
electener: -3358.56246644 hartree
oneelecener: -5827.56823991 hartree
twoeener: 2469.00577347 hartree
cpcmener: -0.02913763 hartree
kineticenergy: 1356.14924043 hartree
xcener: -110.264280813789 hartree
chargesum: -0.0000000
charge: -0.107743 -0.464103 0.138850 -0.398073 -0.404715 0.355998 0.304265 -0.100091 -0.283050 -0.183090 -0.159729 -0.146576 -0.383249 -0.336099 0.057753 0.034843 -0.227164 -0.242099 -0.149645 -0.164478 0.086747 0.097416 0.091750 0.083836 0.089321 0.078668 0.101110 0.139643 0.121068 0.109639 0.102925 0.100127 0.106767 0.100434 0.091325 0.091891 0.101928 0.223506 0.184676 0.144132 0.160429 0.144891 0.142466 0.163499
qa: -0.1077 -0.4641 0.1388 -0.3981 -0.4047 0.3560 0.3043 -0.1001 -0.2830 -0.1831 -0.1597 -0.1466 -0.3832 -0.3361 0.0578 0.0348 -0.2272 -0.2421 -0.1496 -0.1645 0.0867 0.0974 0.0917 0.0838 0.0893 0.0787 0.1011 0.1396 0.1211 0.1096 0.1029 0.1001 0.1068 0.1004 0.0913 0.0919 0.1019 0.2235 0.1847 0.1441 0.1604 0.1449 0.1425 0.1635
va: 1.1974 1.9910 3.3212 2.8339 2.9943 3.8803 3.6092 3.8497 4.0047 3.9043 3.9019 3.7782 3.9544 3.9405 3.5063 4.0341 4.0041 3.9814 3.9844 4.0405 4.0108 3.8048 1.0179 1.0202 1.0171 1.0192 1.0005 0.9990 0.9944 1.0277 1.0214 0.9973 0.9966 1.0058 1.0185 1.0041 1.0006 1.0511 0.9894 1.0042 0.9937 1.0049 1.0085 0.9951
dispcorr: -0.025986766 hartree
energy: -1360.871556482386
dipole: -37.97231 36.40403 -1.56828 -2.50871 2.21069 -0.29803 -2.20306 3.24911 1.04604
magnitude: 1.90854 au
magnitude: 4.85113 debye
