program: Orca
programVersion: 4.2.1
elementType: Cl O N N N C C C C C C C C C C C C C C C C C H H H H H H H H H H H H H H H H H H H H H H
charge: 0
multiplicity: 1
keywords: wb97x-d3
keywords: def2-TZVPP
keywords: def2/J RIJCOSX GRIDX6 NOFINALGRIDX
keywords: grid4 nofinalgrid
keywords: scfconv7
keywords: smallprint printgap noloewdin
keywords: NOSOSCF
formula: C17H22ClN3O
InChI: InChI=1/C17H22ClN3O/c1-16(2)8-7-14(9-13-3-5-15(18)6-4-13)17(16,22)10-21-12-19-11-20-21/h3-6,11-12,14,22H,7-10H2,1-2H3
44 atoms
Cl 4.765032 4.327226 1.597332
O  -1.295832 -0.822079 -1.855363
N  -1.754188 -3.358463 -0.389507
N  -2.132536 -3.518897 -1.660189
N  -3.15687 -5.014191 -0.35662
C  -1.262017 -0.914778 -0.447836
C  -2.602924 -0.400414 0.165374
C  -0.242172 0.132606 0.040233
C  -2.490333 1.115204 -0.093602
C  -0.995776 1.469114 -0.049932
C  -0.819667 -2.316625 -0.015626
C  1.099504 0.128191 -0.694702
C  -2.681051 -0.663047 1.67204
C  -3.868453 -0.954488 -0.484319
C  2.036207 1.164831 -0.138007
C  -2.372406 -4.256076 0.37642
C  2.331759 2.324494 -0.847568
C  2.611468 1.005081 1.121532
C  3.169104 3.300965 -0.325668
C  3.448546 1.967997 1.662196
C  -2.978387 -4.518384 -1.592832
C  3.719555 3.114285 0.930492
H  -0.03726 -0.081299 1.093808
H  -3.076453 1.677749 0.635685
H  -2.905541 1.353952 -1.074259
H  -0.704203 2.016653 -0.948073
H  -0.747746 2.112236 0.794213
H  -0.691538 -2.372912 1.063662
H  0.145184 -2.55483 -0.467941
H  0.943117 0.314071 -1.758024
H  1.570257 -0.856203 -0.612756
H  -3.577588 -0.193311 2.082237
H  -2.754039 -1.726659 1.908608
H  -1.832742 -0.259371 2.2274
H  -4.734133 -0.389503 -0.129629
H  -3.85662 -0.858886 -1.570344
H  -4.058616 -1.999088 -0.233252
H  -1.746919 -1.602249 -2.21038
H  -2.219687 -4.32511 1.44212
H  1.905517 2.476321 -1.831801
H  2.409129 0.110051 1.698392
H  3.385543 4.193649 -0.897048
H  3.885061 1.822804 2.641225
H  -3.477141 -4.902904 -2.468774
elementType: Cl O N C H
totalener: -1360.85628104 hartree
nucrepener: 1952.46487153 hartree
electener: -3313.32115257 hartree
oneelecener: -5737.09473802 hartree
twoeener: 2423.77358545 hartree
cpcmener: -0.02550410 hartree
kineticenergy: 1356.13818292 hartree
xcener: -110.262908117950 hartree
chargesum: 0.0000000
charge: -0.106116 -0.454873 0.138118 -0.377930 -0.403854 0.353631 0.271849 0.000458 -0.243932 -0.230474 -0.229457 -0.122859 -0.365524 -0.371810 0.023712 0.055837 -0.194019 -0.210384 -0.163448 -0.167100 0.082370 0.105011 0.097916 0.082676 0.089326 0.086361 0.090981 0.122504 0.144670 0.088530 0.099968 0.099354 0.091697 0.109127 0.108424 0.092348 0.091205 0.216998 0.174978 0.139410 0.138634 0.141304 0.142087 0.162292
qa: -0.1061 -0.4549 0.1381 -0.3779 -0.4039 0.3536 0.2718 0.0005 -0.2439 -0.2305 -0.2295 -0.1229 -0.3655 -0.3718 0.0237 0.0558 -0.1940 -0.2104 -0.1634 -0.1671 0.0824 0.1050 0.0979 0.0827 0.0893 0.0864 0.0910 0.1225 0.1447 0.0885 0.1000 0.0994 0.0917 0.1091 0.1084 0.0923 0.0912 0.2170 0.1750 0.1394 0.1386 0.1413 0.1421 0.1623
va: 1.1992 2.0145 3.3085 2.8522 3.0248 3.8703 3.7101 3.6874 3.9905 3.9512 3.9725 3.8212 3.9571 3.9277 3.5402 4.0477 3.9602 3.9738 4.0017 4.0021 4.0126 3.8143 1.0100 1.0152 1.0114 1.0097 1.0075 0.9913 0.9962 1.0329 1.0161 1.0060 1.0020 0.9994 1.0033 1.0190 1.0001 1.0662 0.9929 1.0060 1.0046 1.0062 1.0065 0.9945
dispcorr: -0.025266368 hartree
energy: -1360.881547411002
dipole: -27.52515 27.36834 -0.15681 -10.83212 10.39413 -0.43799 -1.48891 2.47634 0.98744
magnitude: 1.09154 au
magnitude: 2.77447 debye
