program: Orca
programVersion: 4.2.1
elementType: Cl O N N N C C C C C C C C C C C C C C C C C H H H H H H H H H H H H H H H H H H H H H H
charge: 0
multiplicity: 1
keywords: wb97x-d3
keywords: def2-TZVPP
keywords: def2/J RIJCOSX GRIDX6 NOFINALGRIDX
keywords: grid4 nofinalgrid
keywords: scfconv7
keywords: smallprint printgap noloewdin
keywords: NOSOSCF
formula: C17H22ClN3O
InChI: InChI=1/C17H22ClN3O/c1-16(2)8-7-14(9-13-3-5-15(18)6-4-13)17(16,22)10-21-12-19-11-20-21/h3-6,11-12,14,22H,7-10H2,1-2H3
44 atoms
Cl 5.014448 2.660613 1.590218
O  -2.358586 -0.60303 -1.926997
N  -1.144077 -2.790361 -0.364165
N  -0.76342 -2.90308 -1.640375
N  0.706535 -3.923956 -0.306363
C  -2.274943 -0.591559 -0.52335
C  -3.468192 0.237529 0.039755
C  -0.989536 0.107021 0.049494
C  -2.911887 0.748845 1.371469
C  -1.48419 1.168432 1.045163
C  -2.332785 -2.042673 -0.005483
C  -0.036984 0.658169 -1.013458
C  -4.761613 -0.552069 0.217679
C  -3.765261 1.427062 -0.881031
C  1.230273 1.173481 -0.391078
C  -0.255898 -3.40021 0.419726
C  1.458254 2.534376 -0.214049
C  2.205036 0.283433 0.05771
C  2.61625 3.001501 0.393084
C  3.367295 0.727798 0.666624
C  0.351159 -3.588638 -1.558318
C  3.562354 2.090763 0.831168
H  -0.423322 -0.632219 0.625057
H  -2.910494 -0.052758 2.117805
H  -3.515497 1.559606 1.785227
H  -1.476178 2.163019 0.590879
H  -0.850196 1.228478 1.93061
H  -3.19698 -2.565319 -0.417184
H  -2.405903 -2.075726 1.080864
H  -0.524046 1.455699 -1.579156
H  0.21841 -0.124402 -1.732139
H  -5.091054 -1.009579 -0.717818
H  -4.681182 -1.339925 0.968945
H  -5.562345 0.113313 0.547712
H  -2.881858 2.01249 -1.138483
H  -4.228978 1.111448 -1.815452
H  -4.465148 2.102546 -0.38401
H  -1.762769 -1.286104 -2.271271
H  -0.349641 -3.437468 1.493721
H  0.724591 3.253241 -0.558444
H  2.064285 -0.783657 -0.072945
H  2.773869 4.064405 0.518033
H  4.11126 0.018193 1.003153
H  0.922047 -3.85491 -2.434134
elementType: Cl O N C H
totalener: -1360.85489394 hartree
nucrepener: 1993.48447028 hartree
electener: -3354.33936422 hartree
oneelecener: -5819.14787351 hartree
twoeener: 2464.80850929 hartree
cpcmener: -0.02489023 hartree
kineticenergy: 1356.12512069 hartree
xcener: -110.259759963742 hartree
chargesum: 0.0000000
charge: -0.105971 -0.431315 0.135931 -0.386818 -0.407638 0.348887 0.273450 -0.120749 -0.236120 -0.189494 -0.180624 -0.107185 -0.341013 -0.375403 0.062537 0.057775 -0.209783 -0.220031 -0.156517 -0.168077 0.079610 0.098520 0.090663 0.083046 0.082134 0.081931 0.086313 0.136959 0.119502 0.097449 0.097089 0.103250 0.090139 0.100950 0.100194 0.096906 0.098389 0.217024 0.177159 0.137933 0.137277 0.141336 0.140862 0.163520
qa: -0.1060 -0.4313 0.1359 -0.3868 -0.4076 0.3489 0.2734 -0.1207 -0.2361 -0.1895 -0.1806 -0.1072 -0.3410 -0.3754 0.0625 0.0578 -0.2098 -0.2200 -0.1565 -0.1681 0.0796 0.0985 0.0907 0.0830 0.0821 0.0819 0.0863 0.1370 0.1195 0.0974 0.0971 0.1032 0.0901 0.1010 0.1002 0.0969 0.0984 0.2170 0.1772 0.1379 0.1373 0.1413 0.1409 0.1635
va: 1.1993 2.0078 3.3146 2.8468 3.0007 3.8327 3.6601 3.8474 3.9977 3.9492 3.9657 3.7666 3.9110 3.9549 3.4938 4.0363 3.9836 3.9833 3.9962 4.0329 4.0068 3.8163 1.0134 1.0109 1.0185 1.0050 1.0122 0.9930 0.9964 1.0189 1.0334 1.0083 1.0001 1.0037 0.9998 1.0127 1.0037 1.0649 0.9912 1.0064 1.0098 1.0059 1.0074 0.9939
dispcorr: -0.025801553 hartree
energy: -1360.880695490640
dipole: -38.17929 36.51330 -1.66598 -1.81601 1.58739 -0.22863 -2.53275 3.49044 0.95769
magnitude: 1.93518 au
magnitude: 4.91885 debye
