program: Orca
programVersion: 4.2.1
elementType: Cl O N N N C C C C C C C C C C C C C C C C C H H H H H H H H H H H H H H H H H H H H H H
charge: 0
multiplicity: 1
keywords: wb97x-d3
keywords: def2-TZVPP
keywords: def2/J RIJCOSX GRIDX6 NOFINALGRIDX
keywords: grid4 nofinalgrid
keywords: scfconv7
keywords: smallprint printgap noloewdin
keywords: NOSOSCF
formula: C17H22ClN3O
InChI: InChI=1/C17H22ClN3O/c1-16(2)8-7-14(9-13-3-5-15(18)6-4-13)17(16,22)10-21-12-19-11-20-21/h3-6,11-12,14,22H,7-10H2,1-2H3
44 atoms
Cl 5.000026 0.34559 -0.498935
O  -1.496099 0.256681 -1.505852
N  -0.441386 -1.921232 0.152448
N  0.448604 -1.671888 -0.813886
N  1.455053 -2.640909 0.927584
C  -2.098368 -0.113441 -0.291743
C  -3.632975 0.148011 -0.395117
C  -1.634214 0.723353 0.95396
C  -4.030485 0.311571 1.073622
C  -2.925103 1.177754 1.661316
C  -1.843266 -1.611733 -0.034528
C  -0.706938 1.904307 0.648931
C  -4.424087 -0.956986 -1.0886
C  -3.896964 1.455206 -1.152393
C  0.715525 1.524502 0.341833
C  0.174669 -2.497191 1.185035
C  1.514347 0.958338 1.333355
C  1.281653 1.731196 -0.912373
C  2.828622 0.597909 1.088019
C  2.597495 1.380056 -1.179288
C  1.571726 -2.116696 -0.305197
C  3.359632 0.811257 -0.173797
H  -1.095789 0.063047 1.640639
H  -4.057324 -0.663734 1.570849
H  -5.025793 0.746986 1.187432
H  -3.122676 2.232736 1.453659
H  -2.845356 1.0865 2.745726
H  -2.19906 -2.208628 -0.874949
H  -2.364465 -1.951711 0.859684
H  -0.702806 2.546755 1.535375
H  -1.11764 2.511606 -0.159405
H  -5.468894 -0.656725 -1.193075
H  -4.045999 -1.157505 -2.093502
H  -4.424428 -1.896824 -0.533954
H  -3.309737 2.299929 -0.791172
H  -3.694775 1.351929 -2.218417
H  -4.949453 1.728638 -1.04746
H  -0.612368 -0.138783 -1.556039
H  -0.342737 -2.796923 2.082947
H  1.108496 0.793695 2.324725
H  0.691543 2.178586 -1.702831
H  3.427777 0.155108 1.872147
H  3.016885 1.548357 -2.16233
H  2.503859 -2.056649 -0.844233
elementType: Cl O N C H
totalener: -1360.85222434 hartree
nucrepener: 2086.00023042 hartree
electener: -3446.85245476 hartree
oneelecener: -6004.70616926 hartree
twoeener: 2557.85371450 hartree
cpcmener: -0.02427657 hartree
kineticenergy: 1356.12879448 hartree
xcener: -110.264764818800 hartree
chargesum: -0.0000000
charge: -0.110445 -0.431380 0.126860 -0.362885 -0.401912 0.341454 0.256477 -0.075898 -0.241933 -0.157816 -0.199868 -0.096943 -0.345044 -0.376241 0.050130 0.044775 -0.243294 -0.235042 -0.129992 -0.121371 0.084929 0.066776 0.080440 0.080602 0.081026 0.082466 0.080973 0.137266 0.121144 0.109835 0.095842 0.101113 0.101925 0.090116 0.099876 0.098342 0.098008 0.217725 0.175187 0.135525 0.142342 0.136054 0.140446 0.152412
qa: -0.1104 -0.4314 0.1269 -0.3629 -0.4019 0.3415 0.2565 -0.0759 -0.2419 -0.1578 -0.1999 -0.0969 -0.3450 -0.3762 0.0501 0.0448 -0.2433 -0.2350 -0.1300 -0.1214 0.0849 0.0668 0.0804 0.0806 0.0810 0.0825 0.0810 0.1373 0.1211 0.1098 0.0958 0.1011 0.1019 0.0901 0.0999 0.0983 0.0980 0.2177 0.1752 0.1355 0.1423 0.1361 0.1404 0.1524
va: 1.1933 2.0149 3.3421 2.8461 3.0043 3.8645 3.6836 3.8288 3.9832 3.9252 3.9667 3.8077 3.9121 3.9468 3.5024 4.0693 3.9329 3.9593 3.9176 3.9721 4.0179 3.7789 1.0089 1.0109 1.0189 1.0034 1.0135 0.9918 0.9954 1.0024 1.0142 1.0034 1.0095 0.9993 1.0013 1.0121 1.0042 1.0725 0.9931 1.0049 1.0111 1.0106 1.0053 0.9977
dispcorr: -0.029237986 hartree
energy: -1360.881462327477
dipole: -43.02589 40.67022 -2.35567 4.86923 -4.92696 -0.05773 2.78878 -1.61983 1.16896
magnitude: 2.63040 au
magnitude: 6.68594 debye
