program: Orca
programVersion: 4.2.1
elementType: Cl O N N N C C C C C C C C C C C C C C C C C H H H H H H H H H H H H H H H H H H H H H H
charge: 0
multiplicity: 1
keywords: wb97x-d3
keywords: def2-TZVPP
keywords: def2/J RIJCOSX GRIDX6 NOFINALGRIDX
keywords: grid4 nofinalgrid
keywords: scfconv7
keywords: smallprint printgap noloewdin
keywords: NOSOSCF
formula: C17H22ClN3O
InChI: InChI=1/C17H22ClN3O/c1-16(2)8-7-14(9-13-3-5-15(18)6-4-13)17(16,22)10-21-12-19-11-20-21/h3-6,11-12,14,22H,7-10H2,1-2H3
44 atoms
Cl 5.02727 2.569489 1.593062
O  -2.389299 -0.595356 -1.923404
N  -1.12387 -2.761981 -0.35643
N  -0.715084 -2.847379 -1.626041
N  0.775031 -3.821378 -0.274032
C  -2.291278 -0.583929 -0.527905
C  -3.487307 0.236299 0.044341
C  -1.007899 0.121912 0.041545
C  -2.923261 0.768857 1.364653
C  -1.503778 1.199061 1.0180
C  -2.330055 -2.038603 -0.011564
C  -0.04402 0.648129 -1.022482
C  -4.770379 -0.566497 0.24023
C  -3.806936 1.412436 -0.88699
C  1.229297 1.145348 -0.398514
C  -0.219071 -3.345559 0.436641
C  1.469897 2.500055 -0.202764
C  2.195833 0.240176 0.034826
C  2.632077 2.947442 0.408362
C  3.362344 0.666894 0.646281
C  0.426546 -3.490054 -1.529673
C  3.572837 2.024655 0.831604
H  -0.444561 -0.606828 0.634267
H  -2.906186 -0.022965 2.122354
H  -3.531911 1.576127 1.77698
H  -1.51259 2.182285 0.54064
H  -0.858298 1.290186 1.891706
H  -3.183927 -2.569991 -0.434031
H  -2.415218 -2.072485 1.075173
H  -0.522462 1.442884 -1.599134
H  0.199175 -0.145451 -1.73256
H  -5.098424 -1.029606 -0.692085
H  -4.674337 -1.348965 0.995479
H  -5.574431 0.091637 0.573811
H  -2.930741 2.003181 -1.152541
H  -4.259984 1.074405 -1.816899
H  -4.515904 2.079858 -0.3928
H  -1.782268 -1.261305 -2.277417
H  -0.324404 -3.402322 1.509295
H  0.739512 3.227204 -0.536653
H  2.040057 -0.823383 -0.112151
H  2.804679 4.005363 0.550398
H  4.104533 -0.049038 0.971594
H  1.022019 -3.727119 -2.397137
totalener: -1360.82774029 hartree
nucrepener: 1998.31002164 hartree
electener: -3359.13776193 hartree
oneelecener: -5828.70348448 hartree
twoeener: 2469.56572255 hartree
kineticenergy: 1356.14302302 hartree
xcener: -110.260430375399 hartree
chargesum: -0.0000000
charge: -0.087435 -0.364683 0.143601 -0.356514 -0.330489 0.374671 0.250896 -0.136244 -0.234717 -0.184825 -0.230941 -0.136724 -0.326307 -0.339903 0.095047 0.033087 -0.186437 -0.197998 -0.135373 -0.155201 0.072692 0.093504 0.077344 0.072303 0.079282 0.076312 0.091743 0.133548 0.102252 0.100534 0.092639 0.107703 0.076914 0.096135 0.088856 0.105405 0.087765 0.193247 0.143918 0.110830 0.126270 0.118586 0.120613 0.138095
qa: -0.0874 -0.3647 0.1436 -0.3565 -0.3305 0.3747 0.2509 -0.1362 -0.2347 -0.1848 -0.2309 -0.1367 -0.3263 -0.3399 0.0950 0.0331 -0.1864 -0.1980 -0.1354 -0.1552 0.0727 0.0935 0.0773 0.0723 0.0793 0.0763 0.0917 0.1335 0.1023 0.1005 0.0926 0.1077 0.0769 0.0961 0.0889 0.1054 0.0878 0.1932 0.1439 0.1108 0.1263 0.1186 0.1206 0.1381
va: 1.2190 2.0814 3.2903 2.8409 3.0289 3.7546 3.7097 3.8676 3.9894 3.9450 4.0004 3.8047 3.9140 3.9689 3.5030 4.0592 4.0176 4.0033 4.0278 4.0716 4.0120 3.9072 1.0156 1.0131 1.0224 1.0103 1.0133 0.9942 0.9983 1.0194 1.0387 1.0096 1.0006 1.0073 1.0057 1.0143 1.0040 1.0886 1.0006 1.0125 1.0141 1.0127 1.0141 1.0008
dispcorr: -0.026011714 hartree
energy: -1360.853752001190
dipole: -38.40720 37.11557 -1.29163 -1.59848 1.41663 -0.18186 -2.61583 3.13732 0.52149
magnitude: 1.40475 au
magnitude: 3.57060 debye
