program: Orca
programVersion: 4.2.1
elementType: Cl O N N N C C C C C C C C C C C C C C C C C H H H H H H H H H H H H H H H H H H H H H H
charge: 0
multiplicity: 1
keywords: wb97x-d3
keywords: def2-TZVPP
keywords: def2/J RIJCOSX GRIDX6 NOFINALGRIDX
keywords: grid4 nofinalgrid
keywords: scfconv7
keywords: smallprint printgap noloewdin
keywords: NOSOSCF
formula: C17H22ClN3O
InChI: InChI=1/C17H22ClN3O/c1-16(2)8-7-14(9-13-3-5-15(18)6-4-13)17(16,22)10-21-12-19-11-20-21/h3-6,11-12,14,22H,7-10H2,1-2H3
44 atoms
Cl 4.945643 0.325034 -0.634304
O  -1.465439 0.251588 -1.476168
N  -0.443502 -1.932019 0.191964
N  0.456097 -1.692796 -0.767969
N  1.453103 -2.61899 1.004986
C  -2.083556 -0.115687 -0.278379
C  -3.615204 0.154661 -0.405936
C  -1.638122 0.713425 0.979961
C  -4.044531 0.315453 1.053811
C  -2.938748 1.157917 1.677206
C  -1.83864 -1.617513 -0.015237
C  -0.714273 1.899911 0.687201
C  -4.394588 -0.943683 -1.124166
C  -3.855147 1.465881 -1.165131
C  0.702508 1.527539 0.346983
C  0.172201 -2.484109 1.243663
C  1.521667 0.936506 1.304566
C  1.240171 1.765727 -0.913128
C  2.8264 0.57322 1.018023
C  2.545382 1.413374 -1.219349
C  1.579329 -2.115019 -0.236425
C  3.329672 0.81219 -0.250022
H  -1.097053 0.053805 1.666592
H  -4.106818 -0.661521 1.544681
H  -5.033171 0.768943 1.147229
H  -3.125528 2.218036 1.489957
H  -2.881024 1.045312 2.760673
H  -2.18834 -2.20873 -0.862102
H  -2.377886 -1.952224 0.871683
H  -0.698387 2.527147 1.584413
H  -1.139534 2.517663 -0.105485
H  -5.433514 -0.63747 -1.257629
H  -3.984188 -1.138259 -2.116671
H  -4.415214 -1.884697 -0.571886
H  -3.300866 2.311596 -0.75959
H  -3.58066 1.373455 -2.214147
H  -4.915601 1.721257 -1.118429
H  -0.595809 -0.173199 -1.536086
H  -0.347059 -2.776996 2.143558
H  1.136124 0.74597 2.299563
H  0.626809 2.228423 -1.676024
H  3.440614 0.096489 1.769033
H  2.945627 1.599261 -2.206534
H  2.517831 -2.054877 -0.764313
totalener: -1360.82600564 hartree
nucrepener: 2089.89539152 hartree
electener: -3450.72139716 hartree
oneelecener: -6012.30935603 hartree
twoeener: 2561.58795887 hartree
kineticenergy: 1356.15255516 hartree
xcener: -110.267307475552 hartree
chargesum: 0.0000000
charge: -0.088686 -0.377330 0.132157 -0.334614 -0.324024 0.381372 0.232568 -0.091733 -0.245111 -0.147818 -0.246022 -0.117854 -0.332750 -0.345595 0.063544 0.019106 -0.233562 -0.219072 -0.089761 -0.082641 0.076475 0.031337 0.062750 0.071106 0.078799 0.081294 0.076869 0.133631 0.105235 0.107611 0.091305 0.095078 0.109062 0.078119 0.086522 0.108984 0.088248 0.203636 0.139730 0.111700 0.127842 0.123288 0.120107 0.139095
qa: -0.0887 -0.3773 0.1322 -0.3346 -0.3240 0.3814 0.2326 -0.0917 -0.2451 -0.1478 -0.2460 -0.1179 -0.3327 -0.3456 0.0635 0.0191 -0.2336 -0.2191 -0.0898 -0.0826 0.0765 0.0313 0.0628 0.0711 0.0788 0.0813 0.0769 0.1336 0.1052 0.1076 0.0913 0.0951 0.1091 0.0781 0.0865 0.1090 0.0882 0.2036 0.1397 0.1117 0.1278 0.1233 0.1201 0.1391
va: 1.2167 2.0769 3.3061 2.8412 3.0345 3.7930 3.7392 3.8412 3.9856 3.9094 3.9956 3.8440 3.9161 3.9560 3.5622 4.0902 3.9622 3.9939 3.9221 3.9835 4.0195 3.8994 1.0103 1.0130 1.0229 1.0075 1.0152 0.9936 0.9968 1.0012 1.0153 1.0075 1.0104 0.9996 1.0070 1.0141 1.0049 1.0889 1.0026 1.0099 1.0149 1.0154 1.0121 1.0009
dispcorr: -0.029372069 hartree
energy: -1360.855377708786
dipole: -42.75963 41.08019 -1.67944 4.93305 -4.91001 0.02304 3.12473 -2.45830 0.66643
magnitude: 1.80698 au
magnitude: 4.59299 debye
