program: Orca
programVersion: 4.2.1
elementType: Cl F F F O O N N N C C C C C C C C C C C C C C C C C C H H H H H H H H H H H H H H H
charge: 0
multiplicity: 1
keywords: wb97x-d3
keywords: def2-TZVPP
keywords: def2/J RIJCOSX GRIDX6 NOFINALGRIDX
keywords: grid4 nofinalgrid
keywords: scfconv7
keywords: smallprint printgap noloewdin
keywords: NOSOSCF
formula: C18H15ClF3N3O2
InChI: InChI=1/C18H15ClF3N3O2/c1-17(26,9-25-11-23-10-24-25)15-7-6-14(8-16(15)18(20,21)22)27-13-4-2-12(19)3-5-13/h2-8,10-11,26H,9H2,1H3
42 atoms
Cl -6.046521 -1.26873 1.979223
F  1.387294 -2.777122 0.927276
F  3.314659 -2.068386 0.36945
F  2.166718 -1.052862 1.90454
O  3.913753 0.521941 0.575678
O  -1.812829 -0.880481 -2.053808
N  2.315147 2.943452 -0.007853
N  2.207661 2.644176 1.292225
N  0.391262 3.753112 0.599646
C  3.451728 0.859883 -0.708833
C  2.074807 0.259753 -1.027473
C  3.39458 2.403207 -0.801503
C  4.483048 0.359632 -1.713219
C  1.443814 -0.801853 -0.354553
C  1.381542 0.824628 -2.09803
C  0.142428 -1.166578 -0.692856
C  0.094297 0.462491 -2.445346
C  -0.536461 -0.518882 -1.709104
C  2.092898 -1.654493 0.711476
C  1.219789 3.586312 -0.405312
C  1.04328 3.152655 1.609038
C  -2.764742 -0.953228 -1.070235
C  -2.782352 -0.085225 0.014199
C  -3.757004 -1.91062 -1.222363
C  -3.795224 -0.185413 0.955087
C  -4.774823 -2.003876 -0.287073
C  -4.783474 -1.144206 0.799953
H  4.34348 2.802736 -0.442291
H  3.266296 2.762645 -1.819038
H  4.615162 -0.718215 -1.627222
H  4.175372 0.576861 -2.735325
H  5.449428 0.837096 -1.542812
H  1.849487 1.597047 -2.692307
H  -0.355929 -1.971779 -0.171747
H  3.413126 1.043993 1.223467
H  -0.408569 0.947567 -3.271198
H  1.076292 3.929855 -1.417218
H  0.65348 3.088255 2.612468
H  -2.023179 0.676142 0.138642
H  -3.738423 -2.582794 -2.07006
H  -3.808518 0.490929 1.798469
H  -5.547104 -2.750895 -0.407676
elementType: Cl F O N C H
totalener: -1769.53780664 hartree
nucrepener: 2713.47589850 hartree
electener: -4483.01370514 hartree
oneelecener: -7824.21864663 hartree
twoeener: 3341.20494149 hartree
cpcmener: -0.03700218 hartree
kineticenergy: 1763.80825813 hartree
xcener: -141.175920072474 hartree
chargesum: -0.0000000
charge: -0.102428 -0.186687 -0.173081 -0.179507 -0.453116 -0.337959 0.129225 -0.376118 -0.413356 0.441739 0.023123 -0.159820 -0.285827 -0.214934 -0.273737 -0.006315 -0.162016 0.164444 0.540429 0.073994 0.088267 0.268499 -0.169626 -0.247382 -0.148190 -0.111895 0.071457 0.137209 0.126259 0.105793 0.096436 0.106791 0.155692 0.142663 0.226777 0.154079 0.183266 0.165253 0.153518 0.152477 0.147247 0.147359
qa: -0.1024 -0.1867 -0.1731 -0.1795 -0.4531 -0.3380 0.1292 -0.3761 -0.4134 0.4417 0.0231 -0.1598 -0.2858 -0.2149 -0.2737 -0.0063 -0.1620 0.1644 0.5404 0.0740 0.0883 0.2685 -0.1696 -0.2474 -0.1482 -0.1119 0.0715 0.1372 0.1263 0.1058 0.0964 0.1068 0.1557 0.1427 0.2268 0.1541 0.1833 0.1653 0.1535 0.1525 0.1472 0.1474
va: 1.2010 1.1071 1.1212 1.1100 1.9663 2.0579 3.3277 2.8647 3.0018 3.6506 3.5345 3.9193 3.9323 3.8485 3.9466 3.7783 4.0364 3.8082 4.4671 4.0320 4.0025 3.6958 3.9141 4.0284 3.9918 3.9574 3.8252 1.0084 0.9995 1.0130 1.0046 1.0070 0.9895 1.0151 1.0602 1.0014 0.9892 0.9923 1.0013 1.0051 1.0034 1.0010
dispcorr: -0.023919878 hartree
energy: -1769.561726518824
dipole: 13.88990 -13.16720 0.72270 17.36302 -15.94893 1.41409 -17.18269 14.59999 -2.58271
magnitude: 3.03188 au
magnitude: 7.70644 debye
