program: Orca
programVersion: 4.2.1
elementType: Cl F F F O O N N N C C C C C C C C C C C C C C C C C C H H H H H H H H H H H H H H H
charge: 0
multiplicity: 1
keywords: wb97x-d3
keywords: def2-TZVPP
keywords: def2/J RIJCOSX GRIDX6 NOFINALGRIDX
keywords: grid4 nofinalgrid
keywords: scfconv7
keywords: smallprint printgap noloewdin
keywords: NOSOSCF
formula: C18H15ClF3N3O2
InChI: InChI=1/C18H15ClF3N3O2/c1-17(26,9-25-11-23-10-24-25)15-7-6-14(8-16(15)18(20,21)22)27-13-4-2-12(19)3-5-13/h2-8,10-11,26H,9H2,1H3
42 atoms
Cl -5.952111 -1.327183 2.114922
F  2.977053 -2.533314 0.244403
F  2.608932 -1.002391 1.730035
F  1.125117 -2.463015 1.298333
O  4.399966 -0.248369 -0.179789
O  -1.823399 -0.645433 -1.986027
N  2.236403 2.581753 0.447498
N  2.132776 3.621789 -0.384787
N  0.161721 3.215552 0.608757
C  3.540546 0.758705 -0.662542
C  2.14867 0.225556 -1.019244
C  3.418087 1.760367 0.51706
C  4.221266 1.452726 -1.844899
C  1.460885 -0.807915 -0.349117
C  1.451806 0.893679 -2.023792
C  0.140923 -1.096422 -0.680063
C  0.133809 0.62408 -2.343478
C  -0.524999 -0.368111 -1.651562
C  2.058605 -1.689093 0.723702
C  1.052284 2.343258 1.013151
C  0.876793 3.962689 -0.252181
C  -2.748504 -0.792433 -0.985509
C  -3.761936 -1.715573 -1.194316
C  -2.720567 -0.024444 0.171904
C  -4.756506 -1.875662 -0.243038
C  -3.709481 -0.1926 1.128412
C  -4.719557 -1.117539 0.916248
H  3.380976 1.226901 1.46285
H  4.292877 2.409032 0.546044
H  4.237746 0.814033 -2.729435
H  3.758304 2.398787 -2.11551
H  5.251734 1.674254 -1.566707
H  1.935746 1.680901 -2.579603
H  -0.389537 -1.896064 -0.183473
H  4.694665 -0.777983 -0.929245
H  -0.367326 1.188405 -3.118476
H  0.894205 1.555485 1.7331
H  0.460571 4.799184 -0.791573
H  -3.779236 -2.308409 -2.099222
H  -1.945081 0.71197 0.341888
H  -5.545494 -2.595832 -0.409738
H  -3.687223 0.40495 2.029195
elementType: Cl F O N C H
totalener: -1769.53395789 hartree
nucrepener: 2733.90123394 hartree
electener: -4503.43519182 hartree
oneelecener: -7864.76625074 hartree
twoeener: 3361.33105891 hartree
cpcmener: -0.03190655 hartree
kineticenergy: 1763.81723924 hartree
xcener: -141.174928084880 hartree
chargesum: -0.0000000
charge: -0.101915 -0.176634 -0.175074 -0.185036 -0.410790 -0.336856 0.135878 -0.362103 -0.406904 0.416087 -0.016615 -0.158270 -0.314624 -0.235573 -0.160875 -0.045195 -0.222313 0.218583 0.550194 0.067028 0.066989 0.259049 -0.239859 -0.150757 -0.119064 -0.164322 0.082270 0.138309 0.131643 0.124718 0.086371 0.113412 0.150532 0.143083 0.225002 0.151254 0.166156 0.161008 0.152738 0.149689 0.147845 0.144942
qa: -0.1019 -0.1766 -0.1751 -0.1850 -0.4108 -0.3369 0.1359 -0.3621 -0.4069 0.4161 -0.0166 -0.1583 -0.3146 -0.2356 -0.1609 -0.0452 -0.2223 0.2186 0.5502 0.0670 0.0670 0.2590 -0.2399 -0.1508 -0.1191 -0.1643 0.0823 0.1383 0.1316 0.1247 0.0864 0.1134 0.1505 0.1431 0.2250 0.1513 0.1662 0.1610 0.1527 0.1497 0.1478 0.1449
va: 1.2014 1.1170 1.1139 1.1102 2.0160 2.0627 3.3207 2.8609 2.9976 3.6981 3.5941 3.8207 3.9325 3.8370 3.8687 3.8352 4.1107 3.7558 4.4426 4.0421 4.0322 3.6993 4.0218 3.9102 3.9605 4.0197 3.8184 1.0137 1.0089 0.9984 1.0221 1.0107 0.9931 1.0158 1.0079 1.0040 1.0016 0.9957 1.0048 0.9982 1.0010 1.0056
dispcorr: -0.025352158 hartree
energy: -1769.559310043903
dipole: 14.08104 -12.80827 1.27277 18.06358 -18.11997 -0.05639 -15.56437 14.14136 -1.42302
magnitude: 1.91000 au
magnitude: 4.85483 debye
