program: Orca
programVersion: 4.2.1
elementType: Cl F F F O O N N N C C C C C C C C C C C C C C C C C C H H H H H H H H H H H H H H H
charge: 0
multiplicity: 1
keywords: wb97x-d3
keywords: def2-TZVPP
keywords: def2/J RIJCOSX GRIDX6 NOFINALGRIDX
keywords: grid4 nofinalgrid
keywords: scfconv7
keywords: smallprint printgap noloewdin
keywords: NOSOSCF
formula: C18H15ClF3N3O2
InChI: InChI=1/C18H15ClF3N3O2/c1-17(26,9-25-11-23-10-24-25)15-7-6-14(8-16(15)18(20,21)22)27-13-4-2-12(19)3-5-13/h2-8,10-11,26H,9H2,1H3
42 atoms
Cl -6.078211 -1.186943 1.915905
F  0.984937 -1.888098 1.616737
F  2.979301 -1.903254 0.876825
F  2.162027 -0.127728 1.820935
O  4.143828 0.358918 0.083428
O  -1.837889 -0.98665 -2.123274
N  2.3345 2.614883 0.169513
N  2.770979 2.8387 1.411583
N  0.527672 2.875831 1.352468
C  3.475508 0.777718 -1.077539
C  2.108022 0.109221 -1.283393
C  3.231539 2.290508 -0.913793
C  4.394555 0.568566 -2.28225
C  1.375393 -0.65554 -0.358065
C  1.466363 0.423367 -2.483313
C  0.063605 -1.030285 -0.644937
C  0.161644 0.072023 -2.765119
C  -0.550211 -0.643484 -1.822248
C  1.892725 -1.128417 0.981977
C  0.999855 2.629469 0.155641
C  1.656649 2.988379 2.076971
C  -2.789234 -1.011111 -1.135814
C  -2.838501 -0.061693 -0.122189
C  -3.754207 -2.003211 -1.219344
C  -3.852603 -0.120204 0.820592
C  -4.776008 -2.053283 -0.284716
C  -4.813348 -1.115697 0.734741
H  4.17771 2.797088 -0.729813
H  2.814936 2.703733 -1.830342
H  4.577943 -0.49522 -2.441887
H  3.999575 0.975334 -3.210049
H  5.352902 1.054832 -2.09669
H  1.984483 1.009101 -3.229487
H  -0.498041 -1.626741 0.058529
H  4.636541 -0.443602 -0.117494
H  -0.295562 0.365689 -3.700613
H  0.418966 2.493201 -0.743322
H  1.657049 3.198941 3.135002
H  -2.099738 0.727235 -0.052035
H  -3.713014 -2.735741 -2.014721
H  -3.889131 0.616075 1.611469
H  -5.528083 -2.826999 -0.353426
elementType: Cl F O N C H
totalener: -1769.53340645 hartree
nucrepener: 2739.69870945 hartree
electener: -4509.23211590 hartree
oneelecener: -7876.99235659 hartree
twoeener: 3367.76024070 hartree
cpcmener: -0.04136875 hartree
kineticenergy: 1763.81723342 hartree
xcener: -141.175018716806 hartree
chargesum: 0.0000000
charge: -0.101053 -0.185865 -0.183774 -0.160469 -0.398927 -0.332122 0.141982 -0.349317 -0.409171 0.402640 -0.131148 -0.135484 -0.300375 -0.123426 -0.135177 -0.093978 -0.259675 0.277682 0.533470 0.040393 0.050462 0.288405 -0.189249 -0.256924 -0.136728 -0.108035 0.069663 0.120229 0.140718 0.113469 0.093577 0.118938 0.142501 0.144479 0.220458 0.152552 0.175418 0.159555 0.159018 0.152048 0.145268 0.147969
qa: -0.1011 -0.1859 -0.1838 -0.1605 -0.3989 -0.3321 0.1420 -0.3493 -0.4092 0.4026 -0.1311 -0.1355 -0.3004 -0.1234 -0.1352 -0.0940 -0.2597 0.2777 0.5335 0.0404 0.0505 0.2884 -0.1892 -0.2569 -0.1367 -0.1080 0.0697 0.1202 0.1407 0.1135 0.0936 0.1189 0.1425 0.1445 0.2205 0.1526 0.1754 0.1596 0.1590 0.1520 0.1453 0.1480
va: 1.2026 1.1085 1.1100 1.1246 2.0264 2.0785 3.3459 2.8883 2.9940 3.8254 3.6062 3.8391 3.9391 3.7428 3.9518 3.8239 4.1028 3.7130 4.4543 4.0658 4.0621 3.6928 3.9421 4.0407 3.9859 3.9471 3.8352 1.0309 0.9947 1.0011 1.0067 1.0047 1.0022 1.0172 1.0140 1.0059 0.9927 0.9967 0.9947 1.0053 1.0052 1.0009
dispcorr: -0.024700600 hartree
energy: -1769.558107051241
dipole: 15.30837 -14.22895 1.07942 12.63090 -12.77815 -0.14726 -21.39940 17.74804 -3.65136
magnitude: 3.81042 au
magnitude: 9.68531 debye
