program: Orca
programVersion: 4.2.1
elementType: Cl F F F O O N N N C C C C C C C C C C C C C C C C C C H H H H H H H H H H H H H H H
charge: 0
multiplicity: 1
keywords: wb97x-d3
keywords: def2-TZVPP
keywords: def2/J RIJCOSX GRIDX6 NOFINALGRIDX
keywords: grid4 nofinalgrid
keywords: scfconv7
keywords: smallprint printgap noloewdin
keywords: NOSOSCF
formula: C18H15ClF3N3O2
InChI: InChI=1/C18H15ClF3N3O2/c1-17(26,9-25-11-23-10-24-25)15-7-6-14(8-16(15)18(20,21)22)27-13-4-2-12(19)3-5-13/h2-8,10-11,26H,9H2,1H3
42 atoms
Cl -6.535828 -3.060504 1.375283
F  0.250526 -1.490179 1.803426
F  2.129913 -1.864605 0.868762
F  1.76599 -0.003126 1.913001
O  3.501607 0.26018 -0.050078
O  -2.446696 -0.709023 -2.096064
N  3.799667 3.057652 0.570532
N  4.477599 3.972517 -0.129211
N  5.626952 3.380037 1.705419
C  2.740659 1.221753 -0.738816
C  1.344175 0.648312 -0.98344
C  2.549953 2.496057 0.11768
C  3.459021 1.556584 -2.047948
C  0.679437 -0.301576 -0.185685
C  0.640396 1.149207 -2.078406
C  -0.58515 -0.762917 -0.55096
C  -0.627748 0.726294 -2.421786
C  -1.234475 -0.25701 -1.66342
C  1.227169 -0.905964 1.089124
C  4.500555 2.711181 1.650911
C  5.556008 4.133371 0.593141
C  -3.355444 -1.25563 -1.225784
C  -3.686938 -0.644821 -0.023793
C  -3.99769 -2.415449 -1.629988
C  -4.664541 -1.207388 0.781367
C  -4.985513 -2.970737 -0.832007
C  -5.30739 -2.365278 0.371638
H  2.02406 3.259383 -0.453271
H  1.949138 2.282484 0.999197
H  4.4977 1.822289 -1.844372
H  3.462821 0.695615 -2.716228
H  3.026535 2.401825 -2.577893
H  1.089648 1.906615 -2.702944
H  -1.071446 -1.52858 0.035351
H  4.435838 0.478035 -0.139106
H  -1.129545 1.146826 -3.282986
H  4.148657 1.993305 2.374805
H  6.327621 4.829274 0.303522
H  -3.201843 0.269243 0.293065
H  -3.736582 -2.882424 -2.570215
H  -4.924605 -0.732918 1.717272
H  -5.489709 -3.872276 -1.150921
elementType: Cl F O N C H
totalener: -1769.53466658 hartree
nucrepener: 2606.12305973 hartree
electener: -4375.65772631 hartree
oneelecener: -7608.84352341 hartree
twoeener: 3233.18579710 hartree
cpcmener: -0.03439139 hartree
kineticenergy: 1763.80810903 hartree
xcener: -141.171109179188 hartree
chargesum: -0.0000000
charge: -0.100882 -0.186954 -0.173706 -0.175003 -0.389603 -0.330496 0.116458 -0.371132 -0.421503 0.364641 -0.013116 -0.153549 -0.307744 -0.186606 -0.146684 -0.085051 -0.252631 0.263844 0.537844 0.059868 0.073091 0.299760 -0.214691 -0.258842 -0.122283 -0.105722 0.063383 0.131420 0.143229 0.101278 0.124358 0.094466 0.158511 0.138736 0.223318 0.150646 0.174002 0.163490 0.163239 0.152608 0.149174 0.148831
qa: -0.1009 -0.1870 -0.1737 -0.1750 -0.3896 -0.3305 0.1165 -0.3711 -0.4215 0.3646 -0.0131 -0.1535 -0.3077 -0.1866 -0.1467 -0.0851 -0.2526 0.2638 0.5378 0.0599 0.0731 0.2998 -0.2147 -0.2588 -0.1223 -0.1057 0.0634 0.1314 0.1432 0.1013 0.1244 0.0945 0.1585 0.1387 0.2233 0.1506 0.1740 0.1635 0.1632 0.1526 0.1492 0.1488
va: 1.2026 1.1050 1.1156 1.1168 2.0343 2.0812 3.3490 2.8726 3.0307 3.8049 3.5274 3.8174 3.9447 3.9048 3.9549 3.8460 4.1030 3.7766 4.4735 4.0661 4.0334 3.6727 3.9706 4.0551 3.9555 3.9431 3.8429 1.0145 1.0080 1.0124 1.0068 1.0089 0.9875 1.0194 1.0175 1.0067 1.0008 0.9945 0.9925 1.0051 1.0023 1.0011
dispcorr: -0.022058239 hartree
energy: -1769.556724814445
dipole: 15.69665 -16.50537 -0.80872 18.66289 -18.11001 0.55288 -17.16361 15.50915 -1.65447
magnitude: 1.92275 au
magnitude: 4.88724 debye
