program: Orca
programVersion: 4.2.1
elementType: Cl F F F O O N N N C C C C C C C C C C C C C C C C C C H H H H H H H H H H H H H H H
charge: 0
multiplicity: 1
keywords: wb97x-d3
keywords: def2-TZVPP
keywords: def2/J RIJCOSX GRIDX6 NOFINALGRIDX
keywords: grid4 nofinalgrid
keywords: scfconv7
keywords: smallprint printgap noloewdin
keywords: NOSOSCF
formula: C18H15ClF3N3O2
InChI: InChI=1/C18H15ClF3N3O2/c1-17(26,9-25-11-23-10-24-25)15-7-6-14(8-16(15)18(20,21)22)27-13-4-2-12(19)3-5-13/h2-8,10-11,26H,9H2,1H3
42 atoms
Cl -7.1177 -0.605298 -1.282753
F  3.544711 -2.427142 -0.741475
F  4.012894 -1.202954 0.98275
F  2.728148 -2.8858 1.173143
O  4.058845 0.115844 -1.353896
O  -1.704781 -1.542514 0.744136
N  2.630836 2.665945 0.899606
N  2.187278 3.825617 0.40868
N  1.079778 3.297842 2.281151
C  3.075014 1.042863 -0.972187
C  1.837583 0.265551 -0.529539
C  3.623347 1.87083 0.222567
C  2.79475 1.960806 -2.164346
C  1.818034 -1.008701 0.07314
C  0.609147 0.909405 -0.666282
C  0.60521 -1.580124 0.44653
C  -0.595008 0.362263 -0.263201
C  -0.593783 -0.906599 0.284141
C  3.034883 -1.864177 0.355811
C  1.958711 2.362865 2.012973
C  1.261013 4.167357 1.26881
C  -2.94112 -1.275186 0.226741
C  -3.1724 -1.180159 -1.139494
C  -3.991374 -1.172964 1.126468
C  -4.460854 -0.966461 -1.602648
C  -5.282267 -0.975277 0.66311
C  -5.507502 -0.865414 -0.699442
H  4.060688 1.203858 0.961798
H  4.414413 2.537108 -0.126238
H  2.355881 1.401691 -2.991488
H  2.148184 2.804897 -1.936062
H  3.740425 2.38639 -2.508829
H  0.568466 1.895664 -1.103402
H  0.565749 -2.565785 0.887198
H  4.836861 0.595825 -1.660455
H  -1.50409 0.936047 -0.383468
H  2.146103 1.469187 2.587565
H  0.698456 5.082259 1.164818
H  -2.36472 -1.276641 -1.853619
H  -3.805132 -1.254968 2.189391
H  -4.640074 -0.890368 -2.666377
H  -6.099429 -0.900481 1.367363
elementType: Cl F O N C H
totalener: -1769.54409701 hartree
nucrepener: 2650.84710359 hartree
electener: -4420.39120060 hartree
oneelecener: -7698.74040771 hartree
twoeener: 3278.34920711 hartree
cpcmener: -0.03122541 hartree
kineticenergy: 1763.79419503 hartree
xcener: -141.170178072555 hartree
chargesum: -0.0000000
charge: -0.099059 -0.171685 -0.177048 -0.186531 -0.371742 -0.321690 0.135459 -0.367212 -0.398897 0.366550 0.008274 -0.202853 -0.307235 -0.183204 -0.177618 -0.114817 -0.185583 0.248164 0.542440 0.059026 0.072643 0.314710 -0.223260 -0.257686 -0.116678 -0.101682 0.058143 0.146309 0.130434 0.118032 0.085149 0.106894 0.149944 0.131187 0.209110 0.156743 0.164743 0.161507 0.158244 0.149638 0.146179 0.144957
qa: -0.0991 -0.1717 -0.1770 -0.1865 -0.3717 -0.3217 0.1355 -0.3672 -0.3989 0.3666 0.0083 -0.2029 -0.3072 -0.1832 -0.1776 -0.1148 -0.1856 0.2482 0.5424 0.0590 0.0726 0.3147 -0.2233 -0.2577 -0.1167 -0.1017 0.0581 0.1463 0.1304 0.1180 0.0851 0.1069 0.1499 0.1312 0.2091 0.1567 0.1647 0.1615 0.1582 0.1496 0.1462 0.1450
va: 1.2047 1.1194 1.1145 1.1069 2.0591 2.0928 3.3043 2.8519 3.0286 3.8102 3.4335 3.9141 3.9297 3.8969 3.9155 3.9781 4.0248 3.7972 4.4550 4.0674 4.0277 3.6754 3.9757 4.0511 3.9533 3.9437 3.8551 1.0047 1.0081 1.0077 1.0250 1.0058 0.9915 1.0289 1.0250 0.9958 0.9993 0.9949 0.9950 1.0061 1.0030 1.0020
dispcorr: -0.023326529 hartree
energy: -1769.567423535114
dipole: 6.78886 -5.96047 0.82839 19.56880 -18.97395 0.59485 -5.26184 4.46715 -0.79469
magnitude: 1.29291 au
magnitude: 3.28631 debye
