program: Orca
programVersion: 4.2.1
elementType: Cl F F F O O N N N C C C C C C C C C C C C C C C C C C H H H H H H H H H H H H H H H
charge: 0
multiplicity: 1
keywords: wb97x-d3
keywords: def2-TZVPP
keywords: def2/J RIJCOSX GRIDX6 NOFINALGRIDX
keywords: grid4 nofinalgrid
keywords: scfconv7
keywords: smallprint printgap noloewdin
keywords: NOSOSCF
formula: C18H15ClF3N3O2
InChI: InChI=1/C18H15ClF3N3O2/c1-17(26,9-25-11-23-10-24-25)15-7-6-14(8-16(15)18(20,21)22)27-13-4-2-12(19)3-5-13/h2-8,10-11,26H,9H2,1H3
42 atoms
Cl -5.965491 -1.259076 2.097431
F  2.98523 -2.544047 0.223867
F  2.628677 -1.015579 1.715437
F  1.140921 -2.474392 1.291926
O  4.399274 -0.250642 -0.202852
O  -1.816259 -0.684277 -1.996616
N  2.234788 2.561126 0.468063
N  2.10247 3.58383 -0.379117
N  0.180794 3.219923 0.710735
C  3.538275 0.757321 -0.672406
C  2.144248 0.223199 -1.024703
C  3.424711 1.751935 0.515219
C  4.209923 1.464307 -1.852782
C  1.464924 -0.817972 -0.357181
C  1.441128 0.888259 -2.027017
C  0.147273 -1.116824 -0.689691
C  0.126895 0.604912 -2.350889
C  -0.524769 -0.394713 -1.662371
C  2.071187 -1.700012 0.711462
C  1.079992 2.350338 1.103877
C  0.858343 3.949809 -0.196833
C  -2.746767 -0.802344 -1.002829
C  -3.740343 -1.754527 -1.175091
C  -2.74624 0.020585 0.117102
C  -4.739504 -1.890357 -0.22486
C  -3.739086 -0.123794 1.073331
C  -4.72795 -1.079205 0.898739
H  3.408847 1.211789 1.457828
H  4.29374 2.409642 0.53249
H  4.225369 0.835432 -2.744582
H  3.743952 2.412351 -2.111428
H  5.241201 1.686704 -1.578079
H  1.917102 1.68385 -2.578254
H  -0.377953 -1.92037 -0.193391
H  4.7203 -0.756049 -0.957639
H  -0.379359 1.165827 -3.125726
H  0.948756 1.573776 1.841429
H  0.424224 4.778152 -0.735148
H  -3.737515 -2.389097 -2.052015
H  -1.990118 0.783988 0.254823
H  -5.512922 -2.633548 -0.363399
H  -3.737114 0.516098 1.945243
elementType: Cl F O N C H
totalener: -1769.54340485 hartree
nucrepener: 2731.52360182 hartree
electener: -4501.06700668 hartree
oneelecener: -7860.05473522 hartree
twoeener: 3358.98772854 hartree
cpcmener: -0.02759837 hartree
kineticenergy: 1763.79943408 hartree
xcener: -141.171168596777 hartree
chargesum: -0.0000000
charge: -0.099961 -0.175955 -0.174582 -0.184656 -0.391302 -0.327605 0.140031 -0.360190 -0.403655 0.411832 -0.012398 -0.162740 -0.319302 -0.243739 -0.171112 -0.028720 -0.206542 0.194315 0.551006 0.070703 0.066547 0.238285 -0.230665 -0.140299 -0.117785 -0.161105 0.081767 0.137259 0.130666 0.122483 0.088799 0.114013 0.148083 0.141629 0.217098 0.149192 0.163874 0.159443 0.149667 0.147410 0.144991 0.143221
qa: -0.1000 -0.1760 -0.1746 -0.1847 -0.3913 -0.3276 0.1400 -0.3602 -0.4037 0.4118 -0.0124 -0.1627 -0.3193 -0.2437 -0.1711 -0.0287 -0.2065 0.1943 0.5510 0.0707 0.0665 0.2383 -0.2307 -0.1403 -0.1178 -0.1611 0.0818 0.1373 0.1307 0.1225 0.0888 0.1140 0.1481 0.1416 0.2171 0.1492 0.1639 0.1594 0.1497 0.1474 0.1450 0.1432
va: 1.2034 1.1182 1.1149 1.1104 2.0374 2.0708 3.3133 2.8562 3.0015 3.7025 3.5799 3.8224 3.9284 3.8541 3.8747 3.8253 4.1061 3.7891 4.4406 4.0326 4.0314 3.7286 4.0191 3.9038 3.9647 4.0160 3.8288 1.0142 1.0081 0.9988 1.0232 1.0101 0.9953 1.0164 1.0145 1.0044 1.0026 0.9958 1.0057 1.0030 1.0019 1.0059
dispcorr: -0.025216474 hartree
energy: -1769.568621326770
dipole: 14.05345 -12.75950 1.29396 18.06545 -18.06951 -0.00406 -15.48514 14.09271 -1.39243
magnitude: 1.90084 au
magnitude: 4.83156 debye
