program: Orca
programVersion: 4.2.1
elementType: Cl F F F O O N N N C C C C C C C C C C C C C C C C C C H H H H H H H H H H H H H H H
charge: 0
multiplicity: 1
keywords: wb97x-d3
keywords: def2-TZVPP
keywords: def2/J RIJCOSX GRIDX6 NOFINALGRIDX
keywords: grid4 nofinalgrid
keywords: scfconv7
keywords: smallprint printgap noloewdin
keywords: NOSOSCF
formula: C18H15ClF3N3O2
InChI: InChI=1/C18H15ClF3N3O2/c1-17(26,9-25-11-23-10-24-25)15-7-6-14(8-16(15)18(20,21)22)27-13-4-2-12(19)3-5-13/h2-8,10-11,26H,9H2,1H3
42 atoms
Cl -6.718715 0.48565 0.44124
F  2.77702 -2.975593 1.00378
F  4.16486 -1.767515 -0.06594
F  3.326758 -1.083814 1.815154
O  4.063209 0.888801 0.117716
O  -1.571201 -2.11672 -0.59056
N  1.722603 2.713959 0.237822
N  2.095948 2.374405 1.475652
N  -0.058192 2.96032 1.45234
C  3.146817 1.061632 -0.928794
C  1.963723 0.085619 -0.85599
C  2.626839 2.520259 -0.872099
C  3.905564 0.869817 -2.236773
C  1.890584 -1.08931 -0.0905
C  0.841589 0.40864 -1.621868
C  0.68843 -1.793705 -0.009696
C  -0.338806 -0.303002 -1.574344
C  -0.423253 -1.386466 -0.718589
C  3.049045 -1.704488 0.662443
C  0.433157 3.050405 0.237505
C  0.99755 2.538744 2.170732
C  -2.742948 -1.459778 -0.341227
C  -2.801475 -0.27579 0.384498
C  -3.906788 -2.051363 -0.812473
C  -4.028623 0.322837 0.623413
C  -5.133532 -1.458037 -0.564144
C  -5.186597 -0.268844 0.14597
H  3.485791 3.183096 -0.756995
H  2.110136 2.823639 -1.779323
H  4.701917 1.610097 -2.334719
H  4.357284 -0.120949 -2.276921
H  3.245039 0.968857 -3.097621
H  0.873243 1.258812 -2.289661
H  0.597869 -2.676316 0.607367
H  3.670683 1.249092 0.929211
H  -1.179605 0.001685 -2.184318
H  -0.094597 3.355683 -0.652127
H  0.960145 2.350069 3.232246
H  -1.906151 0.192715 0.773267
H  -3.856685 -2.976458 -1.372263
H  -4.071372 1.245496 1.186148
H  -6.038149 -1.921372 -0.933671
elementType: Cl F O N C H
totalener: -1769.54664748 hartree
nucrepener: 2707.45509701 hartree
electener: -4477.00174449 hartree
oneelecener: -7811.96106742 hartree
twoeener: 3334.95932293 hartree
cpcmener: -0.03059296 hartree
kineticenergy: 1763.79812489 hartree
xcener: -141.174232554775 hartree
chargesum: -0.0000000
charge: -0.101429 -0.186115 -0.171006 -0.178667 -0.434273 -0.327416 0.137077 -0.375200 -0.405769 0.438766 0.031664 -0.166291 -0.284894 -0.223239 -0.261495 -0.039227 -0.135912 0.149866 0.541509 0.071115 0.084852 0.270789 -0.162135 -0.242658 -0.148804 -0.114618 0.072769 0.137227 0.122861 0.106067 0.106216 0.093456 0.151512 0.134071 0.223389 0.159341 0.179109 0.163867 0.148055 0.149677 0.140661 0.145231
qa: -0.1014 -0.1861 -0.1710 -0.1787 -0.4343 -0.3274 0.1371 -0.3752 -0.4058 0.4388 0.0317 -0.1663 -0.2849 -0.2232 -0.2615 -0.0392 -0.1359 0.1499 0.5415 0.0711 0.0849 0.2708 -0.1621 -0.2427 -0.1488 -0.1146 0.0728 0.1372 0.1229 0.1061 0.1062 0.0935 0.1515 0.1341 0.2234 0.1593 0.1791 0.1639 0.1481 0.1497 0.1407 0.1452
va: 1.2018 1.1081 1.1245 1.1114 1.9878 2.0753 3.3139 2.8698 3.0034 3.6721 3.5395 3.9141 3.9282 3.8822 3.9166 3.9176 3.9525 3.8474 4.4646 4.0232 4.0099 3.7226 3.9087 4.0230 4.0012 3.9649 3.8420 1.0076 1.0003 1.0067 1.0141 1.0048 0.9918 1.0240 1.0621 0.9936 0.9902 0.9928 1.0037 1.0058 1.0085 1.0018
dispcorr: -0.024330409 hartree
energy: -1769.570977893175
dipole: 6.09205 -6.38136 -0.28931 14.68969 -13.42846 1.26123 -13.82701 11.59392 -2.23308
magnitude: 2.58091 au
magnitude: 6.56014 debye
