program: Orca
programVersion: 4.2.1
elementType: Cl F F F O O N N N C C C C C C C C C C C C C C C C C C H H H H H H H H H H H H H H H
charge: 0
multiplicity: 1
keywords: wb97x-d3
keywords: def2-TZVPP
keywords: def2/J RIJCOSX GRIDX6 NOFINALGRIDX
keywords: grid4 nofinalgrid
keywords: scfconv7
keywords: smallprint printgap noloewdin
keywords: NOSOSCF
formula: C18H15ClF3N3O2
InChI: InChI=1/C18H15ClF3N3O2/c1-17(26,9-25-11-23-10-24-25)15-7-6-14(8-16(15)18(20,21)22)27-13-4-2-12(19)3-5-13/h2-8,10-11,26H,9H2,1H3
42 atoms
Cl -6.857562 -2.593061 1.149875
F  2.066501 -0.419994 1.828669
F  0.382636 0.811123 2.389426
F  0.139168 -1.290514 2.083585
O  2.467739 2.732869 -1.401925
O  -2.193789 -1.19491 -2.100801
N  4.851611 1.450745 -0.201838
N  5.237383 2.564182 -0.83409
N  6.722578 2.022233 0.746605
C  2.393853 1.756809 -0.388675
C  1.131663 0.924917 -0.697026
C  3.604112 0.802984 -0.53357
C  2.396758 2.493195 0.955514
C  0.433303 0.046087 0.156098
C  0.658015 1.016544 -2.007699
C  -0.683557 -0.648351 -0.304451
C  -0.4482 0.329133 -2.466889
C  -1.132895 -0.504698 -1.605899
C  0.758778 -0.206655 1.609089
C  5.748034 1.14625 0.742404
C  6.363468 2.871125 -0.23197
C  -3.255645 -1.494401 -1.296786
C  -3.780045 -2.774782 -1.375803
C  -3.843188 -0.547484 -0.46774
C  -4.896008 -3.113042 -0.627667
C  -4.951182 -0.889638 0.288816
C  -5.473848 -2.170898 0.206986
H  3.513792 -0.065335 0.11117
H  3.650283 0.448139 -1.565008
H  2.582709 1.866764 1.82094
H  3.185351 3.245867 0.942696
H  1.454375 3.019213 1.097389
H  1.168405 1.670561 -2.695689
H  -1.211772 -1.32048 0.355627
H  3.370322 3.086186 -1.410675
H  -0.777886 0.443251 -3.491095
H  5.652628 0.288203 1.38998
H  6.94216 3.736902 -0.512689
H  -3.318635 -3.503687 -2.028339
H  -3.446292 0.457679 -0.410526
H  -5.308118 -4.110247 -0.690286
H  -5.410879 -0.155434 0.935165
totalener: -1769.52143220 hartree
nucrepener: 2601.29888628 hartree
electener: -4370.82031848 hartree
oneelecener: -7598.81811753 hartree
twoeener: 3227.99779906 hartree
kineticenergy: 1763.79623418 hartree
xcener: -141.171183135449 hartree
chargesum: -0.0000000
charge: -0.076753 -0.187298 -0.162493 -0.168118 -0.376605 -0.297890 0.107759 -0.351054 -0.329574 0.345901 0.018931 -0.190656 -0.332344 -0.196090 -0.119050 -0.086059 -0.200361 0.207538 0.560325 0.064658 0.083532 0.243026 -0.217993 -0.174235 -0.085510 -0.104987 0.056664 0.106146 0.136648 0.087259 0.100705 0.120677 0.141189 0.139036 0.204585 0.132985 0.143572 0.137357 0.129958 0.138482 0.124129 0.126007
qa: -0.0768 -0.1873 -0.1625 -0.1681 -0.3766 -0.2979 0.1078 -0.3511 -0.3296 0.3459 0.0189 -0.1907 -0.3323 -0.1961 -0.1190 -0.0861 -0.2004 0.2075 0.5603 0.0647 0.0835 0.2430 -0.2180 -0.1742 -0.0855 -0.1050 0.0567 0.1061 0.1366 0.0873 0.1007 0.1207 0.1412 0.1390 0.2046 0.1330 0.1436 0.1374 0.1300 0.1385 0.1241 0.1260
va: 1.2278 1.1022 1.1338 1.1354 2.0394 2.1140 3.3301 2.8588 3.0593 3.7296 3.5538 3.9308 3.9585 3.9444 4.0031 3.8303 4.0524 3.8564 4.3911 4.0557 4.0257 3.8182 4.0552 3.9682 3.9635 3.9832 3.9485 1.0162 1.0006 1.0206 1.0130 1.0073 1.0412 1.0214 1.0807 1.0125 1.0003 0.9995 1.0122 1.0010 1.0091 1.0099
dispcorr: -0.022221464 hartree
energy: -1769.543653661704
dipole: 18.24758 -18.37397 -0.12638 12.97042 -13.38998 -0.41956 -13.14523 12.59382 -0.55141
magnitude: 0.70431 au
magnitude: 1.79022 debye
