program: Orca
programVersion: 4.2.1
elementType: Cl F F F O O N N N C C C C C C C C C C C C C C C C C C H H H H H H H H H H H H H H H
charge: 0
multiplicity: 1
keywords: wb97x-d3
keywords: def2-TZVPP
keywords: def2/J RIJCOSX GRIDX6 NOFINALGRIDX
keywords: grid4 nofinalgrid
keywords: scfconv7
keywords: smallprint printgap noloewdin
keywords: NOSOSCF
formula: C18H15ClF3N3O2
InChI: InChI=1/C18H15ClF3N3O2/c1-17(26,9-25-11-23-10-24-25)15-7-6-14(8-16(15)18(20,21)22)27-13-4-2-12(19)3-5-13/h2-8,10-11,26H,9H2,1H3
42 atoms
Cl -6.075838 -2.136216 1.842402
F  1.068213 -2.669564 0.885471
F  3.043132 -2.129387 0.302158
F  2.029739 -1.056966 1.895244
O  3.895454 0.39296 0.575137
O  -1.99549 -0.3763 -1.969519
N  2.689645 3.052328 0.018431
N  2.520982 2.736434 1.305496
N  1.116423 4.375312 0.725247
C  3.441951 0.785876 -0.683801
C  1.985564 0.382832 -0.957386
C  3.627915 2.320309 -0.797109
C  4.353962 0.131719 -1.720593
C  1.28545 -0.66181 -0.327887
C  1.303019 1.077807 -1.954996
C  -0.047144 -0.904325 -0.653871
C  -0.016302 0.841211 -2.28469
C  -0.705365 -0.14697 -1.608207
C  1.878669 -1.616083 0.692145
C  1.837886 4.029387 -0.311439
C  1.568574 3.553756 1.689475
C  -2.906061 -0.785418 -1.037799
C  -3.002869 -0.188678 0.212977
C  -3.786895 -1.791761 -1.402013
C  -3.978593 -0.609716 1.100774
C  -4.77036 -2.204021 -0.51763
C  -4.858784 -1.615674 0.733316
H  4.644451 2.548134 -0.471024
H  3.531543 2.685008 -1.818159
H  4.319922 -0.951148 -1.626692
H  4.047759 0.390103 -2.734099
H  5.388042 0.449175 -1.577203
H  1.813788 1.849756 -2.514126
H  -0.584529 -1.706233 -0.169248
H  3.465283 0.949676 1.242622
H  -0.507172 1.418236 -3.056988
H  1.781342 4.45552 -1.301434
H  1.191511 3.554175 2.699686
H  -2.325098 0.604986 0.500249
H  -3.705761 -2.247629 -2.379866
H  -4.056089 -0.148345 2.075307
H  -5.459549 -2.987194 -0.80088
totalener: -1769.51973255 hartree
nucrepener: 2686.80536097 hartree
electener: -4456.32509352 hartree
oneelecener: -7770.41443746 hartree
twoeener: 3314.08934394 hartree
kineticenergy: 1763.80762742 hartree
xcener: -141.173723604471 hartree
chargesum: -0.0000000
charge: -0.077515 -0.178443 -0.159701 -0.167224 -0.370838 -0.299839 0.137459 -0.341342 -0.330749 0.439868 -0.011335 -0.229608 -0.269792 -0.210579 -0.224989 -0.039581 -0.168723 0.189411 0.543029 0.053534 0.082882 0.245455 -0.171604 -0.219054 -0.105522 -0.085942 0.057239 0.134563 0.105091 0.108053 0.079276 0.096718 0.117091 0.140361 0.207208 0.129977 0.138635 0.138566 0.139232 0.129448 0.125664 0.123620
qa: -0.0775 -0.1784 -0.1597 -0.1672 -0.3708 -0.2998 0.1375 -0.3413 -0.3307 0.4399 -0.0113 -0.2296 -0.2698 -0.2106 -0.2250 -0.0396 -0.1687 0.1894 0.5430 0.0535 0.0829 0.2455 -0.1716 -0.2191 -0.1055 -0.0859 0.0572 0.1346 0.1051 0.1081 0.0793 0.0967 0.1171 0.1404 0.2072 0.1300 0.1386 0.1386 0.1392 0.1294 0.1257 0.1236
va: 1.2270 1.1165 1.1426 1.1305 2.0499 2.1111 3.3071 2.8754 3.0604 3.6561 3.6224 3.9846 3.9137 3.9655 3.9500 3.7600 4.0992 3.8753 4.4630 4.0632 4.0259 3.8185 3.9653 4.0555 3.9878 3.9647 3.9484 1.0040 0.9958 1.0202 1.0054 1.0111 0.9971 1.0210 1.0747 1.0123 1.0011 0.9988 1.0013 1.0124 1.0103 1.0093
dispcorr: -0.023142311 hartree
energy: -1769.542874860349
dipole: 15.22520 -14.81184 0.41335 18.59677 -17.75163 0.84514 -16.53784 14.92737 -1.61047
magnitude: 1.86514 au
magnitude: 4.74080 debye
