program: Orca
programVersion: 4.2.1
elementType: Cl F F F O O N N N C C C C C C C C C C C C C C C C C C H H H H H H H H H H H H H H H
charge: 0
multiplicity: 1
keywords: wb97x-d3
keywords: def2-TZVPP
keywords: def2/J RIJCOSX GRIDX6 NOFINALGRIDX
keywords: grid4 nofinalgrid
keywords: scfconv7
keywords: smallprint printgap noloewdin
keywords: NOSOSCF
formula: C18H15ClF3N3O2
InChI: InChI=1/C18H15ClF3N3O2/c1-17(26,9-25-11-23-10-24-25)15-7-6-14(8-16(15)18(20,21)22)27-13-4-2-12(19)3-5-13/h2-8,10-11,26H,9H2,1H3
42 atoms
Cl -6.107435 -2.05455 1.767639
F  3.038606 -2.174644 0.23661
F  2.020635 -1.153082 1.859497
F  1.057763 -2.725003 0.789489
O  3.900006 0.333766 0.602768
O  -1.977242 -0.32287 -2.002885
N  2.696758 3.011656 0.140404
N  2.518325 2.648181 1.413421
N  1.10998 4.299992 0.880192
C  3.455431 0.774454 -0.643283
C  2.000131 0.384378 -0.941849
C  3.641902 2.311953 -0.695723
C  4.374517 0.158771 -1.696901
C  1.291701 -0.678495 -0.353125
C  1.327808 1.11533 -1.920283
C  -0.039469 -0.903433 -0.696252
C  0.009572 0.896237 -2.266634
C  -0.68791 -0.110643 -1.628171
C  1.874292 -1.669776 0.637219
C  1.84261 3.99554 -0.16168
C  1.556865 3.444826 1.81749
C  -2.899821 -0.725891 -1.080593
C  -3.805859 -1.701304 -1.466736
C  -2.983127 -0.152773 0.182102
C  -4.800795 -2.106346 -0.592086
C  -3.970737 -0.566944 1.059971
C  -4.875689 -1.54216 0.670874
H  4.655961 2.527021 -0.353112
H  3.553286 2.717169 -1.702279
H  5.407669 0.469781 -1.533782
H  4.339126 -0.926926 -1.64313
H  4.076702 0.454608 -2.702666
H  1.845594 1.903526 -2.449416
H  -0.584035 -1.718755 -0.243042
H  3.464746 0.863623 1.288404
H  -0.473838 1.501358 -3.021874
H  1.793857 4.457095 -1.136083
H  1.171288 3.407598 2.823867
H  -3.734923 -2.138927 -2.453571
H  -2.285958 0.617188 0.486808
H  -5.509553 -2.865495 -0.891884
H  -4.037822 -0.124018 2.043791
totalener: -1769.51970498 hartree
nucrepener: 2688.42742026 hartree
electener: -4457.94712524 hartree
oneelecener: -7773.64851877 hartree
twoeener: 3315.70139353 hartree
kineticenergy: 1763.81128841 hartree
xcener: -141.174318640299 hartree
chargesum: -0.0000000
charge: -0.077844 -0.159522 -0.167180 -0.178344 -0.370338 -0.300277 0.137278 -0.341291 -0.330914 0.438290 -0.009355 -0.228654 -0.269862 -0.209721 -0.226746 -0.038353 -0.166622 0.185422 0.543784 0.053706 0.083070 0.243977 -0.219793 -0.168696 -0.085516 -0.106876 0.057189 0.134758 0.104671 0.096903 0.108341 0.079282 0.116867 0.140725 0.206752 0.130274 0.138353 0.138601 0.129469 0.139322 0.123380 0.125492
qa: -0.0778 -0.1595 -0.1672 -0.1783 -0.3703 -0.3003 0.1373 -0.3413 -0.3309 0.4383 -0.0094 -0.2287 -0.2699 -0.2097 -0.2267 -0.0384 -0.1666 0.1854 0.5438 0.0537 0.0831 0.2440 -0.2198 -0.1687 -0.0855 -0.1069 0.0572 0.1348 0.1047 0.0969 0.1083 0.0793 0.1169 0.1407 0.2068 0.1303 0.1384 0.1386 0.1295 0.1393 0.1234 0.1255
va: 1.2266 1.1428 1.1306 1.1167 2.0503 2.1100 3.3071 2.8747 3.0596 3.6580 3.6194 3.9846 3.9141 3.9629 3.9503 3.7621 4.0979 3.8767 4.4630 4.0633 4.0243 3.8196 4.0542 3.9610 3.9657 3.9900 3.9473 1.0039 0.9960 1.0110 1.0201 1.0053 0.9972 1.0206 1.0750 1.0121 1.0013 0.9988 1.0124 1.0013 1.0093 1.0104
dispcorr: -0.023179271 hartree
energy: -1769.542884246918
dipole: 15.41574 -14.97193 0.44381 18.92169 -18.02066 0.90103 -15.83586 14.25544 -1.58042
magnitude: 1.87258 au
magnitude: 4.75972 debye
