program: Orca
programVersion: 4.2.1
elementType: Cl F F F O O N N N C C C C C C C C C C C C C C C C C C H H H H H H H H H H H H H H H
charge: 0
multiplicity: 1
keywords: wb97x-d3
keywords: def2-TZVPP
keywords: def2/J RIJCOSX GRIDX6 NOFINALGRIDX
keywords: grid4 nofinalgrid
keywords: scfconv7
keywords: smallprint printgap noloewdin
keywords: NOSOSCF
formula: C18H15ClF3N3O2
InChI: InChI=1/C18H15ClF3N3O2/c1-17(26,9-25-11-23-10-24-25)15-7-6-14(8-16(15)18(20,21)22)27-13-4-2-12(19)3-5-13/h2-8,10-11,26H,9H2,1H3
42 atoms
Cl -6.712043 0.584779 0.308344
F  2.762268 -2.82447 1.364806
F  4.085727 -2.220643 -0.193766
F  3.740051 -0.940075 1.522286
O  4.493582 0.395062 -0.746655
O  -1.517623 -2.031289 -0.378059
N  1.824348 2.358889 0.685078
N  1.190653 3.302756 -0.017239
N  -0.223375 2.318474 1.416228
C  3.248496 1.029593 -0.877876
C  2.064228 0.057434 -0.840707
C  3.167569 1.950284 0.371702
C  3.265663 1.89408 -2.143939
C  1.988294 -1.125638 -0.078345
C  0.89997 0.455114 -1.496195
C  0.773945 -1.794387 0.045079
C  -0.305177 -0.207652 -1.379157
C  -0.373925 -1.326548 -0.571013
C  3.1550 -1.763521 0.646609
C  0.96249 1.774325 1.527798
C  -0.030844 3.24715 0.456223
C  -2.700832 -1.363276 -0.222414
C  -2.80067 -0.178505 0.496928
C  -3.83099 -1.947548 -0.773518
C  -4.040058 0.419647 0.655362
C  -5.06992 -1.351724 -0.604895
C  -5.169115 -0.166584 0.10566
H  3.563035 1.421354 1.235524
H  3.777874 2.840259 0.217914
H  3.197063 1.28346 -3.04681
H  2.471963 2.637264 -2.171167
H  4.209605 2.439274 -2.171665
H  0.910314 1.3434 -2.107921
H  0.691456 -2.692988 0.638021
H  4.697137 -0.062767 -1.567063
H  -1.178672 0.165211 -1.89733
H  1.241634 0.972646 2.194273
H  -0.808561 3.906333 0.103868
H  -1.93165 0.29776 0.935119
H  -3.740852 -2.871643 -1.328819
H  -4.119319 1.340957 1.215318
H  -5.952484 -1.807004 -1.032035
totalener: -1769.51750563 hartree
nucrepener: 2726.93381758 hartree
electener: -4496.45132321 hartree
oneelecener: -7850.57233713 hartree
twoeener: 3354.12101392 hartree
kineticenergy: 1763.81382883 hartree
xcener: -141.173332703102 hartree
chargesum: -0.0000000
charge: -0.082616 -0.174836 -0.170941 -0.169201 -0.325133 -0.301318 0.138288 -0.327784 -0.360165 0.366082 -0.030321 -0.164326 -0.314654 -0.251486 -0.144000 -0.082305 -0.182919 0.221765 0.556121 0.052802 0.077390 0.236474 -0.152331 -0.206732 -0.158348 -0.100655 0.080864 0.137516 0.118278 0.108685 0.094762 0.111738 0.135238 0.134671 0.178625 0.134609 0.144695 0.131104 0.159371 0.128928 0.129730 0.122334
qa: -0.0826 -0.1748 -0.1709 -0.1692 -0.3251 -0.3013 0.1383 -0.3278 -0.3602 0.3661 -0.0303 -0.1643 -0.3147 -0.2515 -0.1440 -0.0823 -0.1829 0.2218 0.5561 0.0528 0.0774 0.2365 -0.1523 -0.2067 -0.1583 -0.1007 0.0809 0.1375 0.1183 0.1087 0.0948 0.1117 0.1352 0.1347 0.1786 0.1346 0.1447 0.1311 0.1594 0.1289 0.1297 0.1223
va: 1.2217 1.1244 1.1289 1.1232 2.0933 2.1112 3.2711 2.8329 2.9983 3.7815 3.6163 3.8355 3.9326 3.9399 3.8845 3.9478 4.0233 3.8399 4.4344 4.0383 4.0143 3.7953 3.9052 4.0354 4.0439 3.9830 3.9088 1.0143 1.0143 1.0001 1.0275 1.0119 1.0037 1.0257 1.0491 1.0059 1.0061 1.0022 1.0120 1.0125 1.0119 1.0101
dispcorr: -0.025845542 hartree
energy: -1769.543351172870
dipole: 5.86761 -5.26954 0.59806 15.32193 -15.20257 0.11935 -11.36034 10.36233 -0.99801
magnitude: 1.16960 au
magnitude: 2.97288 debye
