program: Orca
programVersion: 4.2.1
elementType: Cl O N N N C C C C C C C C C C C C C C C C C C H H H H H H H H H H H H H H H H H H H H H H H H
charge: 0
multiplicity: 1
keywords: wb97x-d3
keywords: def2-TZVPP
keywords: def2/J RIJCOSX GRIDX6 NOFINALGRIDX
keywords: grid4 nofinalgrid
keywords: scfconv7
keywords: smallprint printgap noloewdin
keywords: NOSOSCF
formula: C18H24ClN3O
InChI: InChI=1/C18H24ClN3O/c1-13(2)17-8-5-15(9-14-3-6-16(19)7-4-14)18(17,23)10-22-12-20-11-21-22/h3-4,6-7,11-13,15,17,23H,5,8-10H2,1-2H3
47 atoms
Cl 5.288425 0.126394 -0.597593
O  -1.205884 -0.020333 -1.462434
N  -0.277588 1.613019 0.789945
N  0.589172 1.772868 -0.215274
N  1.585122 2.203584 1.735537
C  -1.79674 -0.096966 -0.18776
C  -3.282063 -0.464389 -0.395357
C  -1.251766 -1.253731 0.723015
C  -3.683736 -1.121255 0.91797
C  -2.496207 -2.034574 1.191788
C  -4.220759 0.608368 -0.97329
C  -1.655747 1.253273 0.533005
C  -0.237893 -2.186823 0.055392
C  -4.907381 1.484547 0.07263
C  -5.284856 -0.052708 -1.847251
C  1.138621 -1.609086 -0.127055
C  0.332122 1.87129 1.947112
C  1.674005 -1.364918 -1.388079
C  1.927397 -1.318823 0.984382
C  2.948755 -0.839683 -1.543872
C  3.201343 -0.791706 0.851769
C  1.693765 2.121903 0.397643
C  3.701474 -0.553593 -0.418222
H  -3.238774 -1.274142 -1.137185
H  -0.770694 -0.820198 1.605312
H  -4.62661 -1.666618 0.850093
H  -3.800421 -0.382967 1.717038
H  -2.415792 -2.343095 2.235097
H  -2.604894 -2.947998 0.599264
H  -3.627553 1.257451 -1.627885
H  -2.158554 1.231797 1.4986
H  -2.099959 2.054336 -0.059937
H  -0.62999 -2.538643 -0.901267
H  -0.15315 -3.074761 0.690043
H  -0.367502 0.462505 -1.401688
H  -4.216213 1.974742 0.758178
H  -5.610213 0.907878 0.677868
H  -5.480747 2.274959 -0.415878
H  -5.888643 -0.760918 -1.273793
H  -4.8374 -0.599947 -2.679039
H  -5.967521 0.686434 -2.271427
H  -0.170042 1.813565 2.900279
H  1.09114 -1.58877 -2.272985
H  1.546572 -1.509087 1.981252
H  3.343993 -0.655162 -2.533967
H  3.793065 -0.568554 1.729256
H  2.604563 2.327271 -0.142171
elementType: Cl O N C H
totalener: -1400.16902442 hartree
nucrepener: 2211.75865996 hartree
electener: -3611.92768437 hartree
oneelecener: -6307.98483373 hartree
twoeener: 2696.05714936 hartree
cpcmener: -0.02486340 hartree
kineticenergy: 1395.23908159 hartree
xcener: -114.441136419088 hartree
chargesum: -0.0000000
charge: -0.110715 -0.438934 0.127843 -0.363906 -0.399988 0.470232 -0.061613 -0.045494 -0.199828 -0.168787 -0.001300 -0.236374 -0.095129 -0.310942 -0.296591 0.057689 0.042700 -0.234542 -0.243424 -0.127983 -0.126992 0.085700 0.070584 0.063010 0.081048 0.081985 0.074414 0.081023 0.082809 0.044174 0.121873 0.136939 0.087092 0.109564 0.221954 0.094177 0.085176 0.100101 0.084320 0.089478 0.090065 0.175365 0.141301 0.134506 0.140789 0.134394 0.152237
qa: -0.1107 -0.4389 0.1278 -0.3639 -0.4000 0.4702 -0.0616 -0.0455 -0.1998 -0.1688 -0.0013 -0.2364 -0.0951 -0.3109 -0.2966 0.0577 0.0427 -0.2345 -0.2434 -0.1280 -0.1270 0.0857 0.0706 0.0630 0.0810 0.0820 0.0744 0.0810 0.0828 0.0442 0.1219 0.1369 0.0871 0.1096 0.2220 0.0942 0.0852 0.1001 0.0843 0.0895 0.0901 0.1754 0.1413 0.1345 0.1408 0.1344 0.1522
va: 1.1928 2.0119 3.3380 2.8477 3.0061 3.7688 3.8139 3.8250 4.0012 3.9617 3.8101 3.9651 3.8017 3.9360 3.9237 3.5162 4.0712 3.9567 3.9303 3.9718 3.9163 4.0176 3.7783 1.0307 1.0097 1.0154 1.0047 1.0126 1.0059 1.0352 0.9870 0.9918 1.0193 1.0022 1.0666 1.0016 0.9962 1.0055 1.0017 1.0060 1.0037 0.9931 1.0124 1.0054 1.0051 1.0110 0.9978
dispcorr: -0.030434083 hartree
energy: -1400.199458498775
dipole: -50.62965 48.31750 -2.31215 -5.54997 5.06046 -0.48951 1.42304 -0.29386 1.12918
magnitude: 2.61930 au
magnitude: 6.65773 debye
