program: Gaussian 09
title: 000063494
version: EM64L-G09RevD.01
frameworkgroup: C1[X(C19H16N4OS)]
method: RPBEPBE
basis: SDD
operation: Freq
keyword: #p
keyword: freq=noraman
keyword: PBEPBE/SDD
title: #p freq=noraman PBEPBE/SDD
converged: YES YES NO NO
title: Mulliken charges:
elementType: S O N N N N C C C C C C C C C C C C C C C C C C C H H H H H H H H H H H H H H H H
charge: 0.331834 -0.224048 -0.260286 -0.035022 0.012877 -0.062440 -0.137983 0.059916 0.146040 0.130261 -0.233460 -0.108535 0.074193 0.329189 -0.659735 -0.670312 -0.315297 -0.350015 -0.352351 -0.318991 -0.242428 -0.202153 -0.227749 -0.236066 -0.229279 0.224649 0.231652 0.222767 0.225098 0.228401 0.207538 0.234985 0.272539 0.264181 0.261314 0.243096 0.236997 0.236387 0.230445 0.229877 0.231914
chargesum: 0.00000
title: Mulliken charges with hydrogens summed into heavy atoms:
elementType: S O N N N N C C C C C C C C C C C C C C C C C C C
charge: 0.331834 -0.224048 -0.260286 -0.035022 0.012877 -0.062440 0.086666 0.059916 0.146040 0.130261 -0.233460 -0.108535 0.074193 0.329189 0.019782 0.000612 -0.042758 -0.085834 -0.091037 -0.075894 -0.005431 0.034234 0.002696 -0.006189 0.002635
polarizability: 3.81338751e+02 -3.56442366e+01 2.89677437e+02 -2.32596454e+01 -2.12174013e+01 1.49646576e+02
1716.lowfreq: -2.4337 0.0009 0.0011 0.0019 3.8361 6.8488 11.7235 24.2699 36.7567
frequency: 11.0344 24.2443 36.7545 45.7131 53.5017 58.7187 86.8192 105.6442 129.7744 145.7967 178.7470 193.7147 197.5543 215.0728 237.5754 256.6170 272.5672 282.2526 309.3485 315.5798 352.4143 390.7128 398.4552 406.0991 429.4740 457.5820 475.0323 506.3949 533.6493 540.9965 565.3749 577.3118 594.6069 612.3580 615.0980 640.0812 652.1278 664.0897 679.7104 697.4459 698.6598 707.4579 774.8978 781.3687 790.2739 803.0258 850.9828 857.0233 867.3210 889.1807 897.2197 923.5352 932.8349 960.5197 976.0325 980.1954 980.6000 989.4243 998.5077 1000.6250 1003.6582 1020.9265 1026.8328 1039.7779 1086.3820 1087.6597 1102.2471 1102.9501 1118.8530 1165.0379 1172.1325 1174.7146 1191.1723 1197.8275 1213.2773 1258.4255 1262.2062 1283.1196 1310.4495 1319.0145 1329.5057 1380.5232 1383.6254 1392.9774 1395.9426 1413.1717 1435.5813 1442.4147 1453.3006 1458.9600 1461.2012 1467.5765 1475.1697 1484.2480 1490.0405 1543.7077 1564.9731 1588.5170 1609.7393 1613.9878 1628.0500 2982.4988 2985.9255 2995.8076 3087.0503 3091.9848 3094.7185 3106.0983 3129.1872 3138.1398 3139.0213 3150.9728 3152.3308 3162.4824 3166.8337 3174.0589 3176.0992
redmass: 2.6953 6.2038 4.6149 8.5588 4.0865 6.8998 4.8913 5.8089 4.9686 4.6998 4.7197 1.1679 3.4910 3.2001 2.0139 3.6409 2.9062 5.3982 6.5026 3.8512 6.7822 5.9025 3.6931 2.9269 3.7765 4.4981 4.9709 8.4767 5.8853 4.4172 8.4821 8.4209 7.1246 8.1000 7.0448 4.1627 7.2136 6.3489 5.1321 5.0636 1.7887 6.5497 2.0810 1.9084 2.5007 6.7796 1.2598 6.2789 3.0816 8.2543 1.4865 1.1744 1.4535 1.4488 6.4537 1.3921 1.3796 6.1953 1.6142 3.5149 1.3572 2.5157 2.3840 2.5185 2.5517 1.8142 1.9462 2.3267 2.5314 1.3047 1.7025 1.0546 1.1153 3.1504 3.0058 2.5354 3.4981 1.3407 2.6437 1.3407 1.5964 1.1930 8.2295 9.4363 1.3098 7.4189 2.3034 4.0370 2.8052 2.6570 1.0459 1.0564 1.0439 2.4937 1.1357 10.8756 6.9652 6.2299 6.2525 7.3334 10.2982 1.0821 1.0349 1.0361 1.1007 1.1012 1.1004 1.1000 1.0850 1.0864 1.0884 1.0933 1.0901 1.0970 1.0955 1.0996 1.1000
irintensity: 0.2886 1.5209 0.2018 2.0485 0.7401 3.7645 0.2495 0.3585 1.1691 0.1922 0.9289 0.2853 1.0384 2.0008 0.6247 0.5275 1.5078 4.4276 1.1019 0.7708 2.1147 1.6219 2.8998 0.6909 1.2595 0.6400 4.9154 1.5322 0.7995 13.6632 1.2180 1.9355 26.9294 0.9113 1.5668 7.6067 9.8986 9.3631 6.2138 4.4574 69.4850 21.7636 64.7506 47.1950 17.8599 7.3833 1.9861 13.0024 1.3235 25.4966 0.7377 4.2337 5.6436 2.5246 14.5422 2.5581 3.4183 3.5915 4.1765 11.0764 0.4085 51.0899 18.1889 25.2312 59.6057 1.8996 18.5935 17.3202 1.4677 5.4629 5.7727 0.1327 10.1135 50.4834 39.6303 24.7143 113.7247 0.8133 120.4768 2.4159 9.4558 22.5333 0.1120 57.6605 9.0623 134.8263 10.2357 16.4923 1.8194 58.9119 6.1042 1.9886 19.2390 31.7825 32.5826 334.8974 0.4670 12.6049 28.2964 137.6044 161.1381 11.3587 25.2036 32.7046 25.0350 11.1296 54.7919 28.2686 0.4012 4.4753 4.1285 24.1931 7.2690 22.5480 9.4161 15.6369 24.6213
temp: 298.150 k
press: 1.00000 atm
elementType: 16 8 7 7 7 7 6 6 6 6 6 6 6 6 6 6 6 6 6 6 6 6 6 6 6 1 1 1 1 1 1 1 1 1 1 1 1 1 1 1 1
symmnumber: 1
zpe: 810403.1 jmol-1
zpe.correction: 0.308666 hartree
zpe.thermalcorrener: 0.330346 hartree
zpe.thermalcorrenthalpy: 0.331290 hartree
zpe.thermalcorrgfe: 0.255193 hartree
zpe.sumelectzpe: -1424.159949 hartree
zpe.sumelectthermal: -1424.138269 hartree
zpe.sumelectthermalent: -1424.137325 hartree
zpe.sumelectthermalfe: -1424.213422 hartree
dipole: -0.3725 0.6676 1.8007
dipole: 1.9563
quadrupole: -118.5355 -144.0241 -157.3733
quadrupole: -2.1584 -10.7591 0.2583
quadrupole: 21.4421 -4.0465 -17.3956 -2.1584 -10.7591 0.2583
hfenergy: -1424.4686149 hartree
pointgroup: C01 [X(C19H16N4O1S1)]
dipole: 0.1062976 0.2431382 -0.7224778 debye
polarizability: 380.5195878|30.7842863|286.1123191|-40.5860213|18.4261282|154.0308572 unknown
InChI: InChI=1S/C19H16N4OS/c1-12(2)17-21-22-19(25-17)23-16(13-8-4-3-5-9-13)20-15-11-7-6-10-14(15)18(23)24/h3-12H,1-2H3
charge 0 multiplicity 1
41 atoms
S  1.879409 -1.666107 -1.245435
O  -0.878755 -2.746538 -0.467602
N  -0.458179 -0.445637 -0.146908
N  -2.246486 1.118906 0.261489
N  1.646591 -0.226379 0.997524
N  3.008901 -0.549627 0.902349
C  4.69828 -1.822865 -0.477505
C  -0.972549 0.887136 -0.004125
C  -2.754266 -1.296449 0.059032
C  -1.344194 -1.601287 -0.221679
C  0.932544 -0.69916 -0.024354
C  3.32441 -1.27431 -0.170501
C  -3.14716 0.047497 0.353273
C  -0.073752 2.051678 -0.228718
C  4.724694 -3.363561 -0.253864
C  5.78322 -1.11454 0.368128
C  -3.710521 -2.344954 0.087746
C  -4.501391 0.317285 0.692243
C  -0.281223 3.222476 0.545089
C  0.91926 2.055793 -1.243967
C  -5.04568 -2.06403 0.42172
C  -5.437222 -0.729783 0.729144
C  0.508183 4.369262 0.326368
C  1.696868 3.210157 -1.470319
C  1.502376 4.366919 -0.680245
H  4.906612 -1.633648 -1.550303
H  4.521782 -3.601232 0.80538
H  5.722368 -3.759087 -0.515407
H  3.972015 -3.88162 -0.874482
H  5.78142 -0.024945 0.194142
H  6.77779 -1.515835 0.102963
H  5.607536 -1.279256 1.444316
H  -3.375662 -3.361234 -0.143442
H  -4.78291 1.352156 0.9077
H  -1.06398 3.214216 1.309259
H  1.063359 1.177478 -1.881766
H  -5.786297 -2.869919 0.448145
H  -6.479705 -0.517479 0.99027
H  0.349567 5.263264 0.938949
H  2.452128 3.208124 -2.263701
H  2.115517 5.258735 -0.850806
