program: Orca
programVersion: 4.2.1
elementType: Cl O N N N C C C C C C C C C C C C C C C C C C H H H H H H H H H H H H H H H H H H H H H H H H
charge: 0
multiplicity: 1
keywords: wb97x-d3
keywords: def2-TZVPP
keywords: def2/J RIJCOSX GRIDX6 NOFINALGRIDX
keywords: grid4 nofinalgrid
keywords: scfconv7
keywords: smallprint printgap noloewdin
keywords: NOSOSCF
formula: C18H24ClN3O
InChI: InChI=1/C18H24ClN3O/c1-13(2)17-8-5-15(9-14-3-6-16(19)7-4-14)18(17,23)10-22-12-20-11-21-22/h3-4,6-7,11-13,15,17,23H,5,8-10H2,1-2H3
47 atoms
Cl 5.256105 0.174051 -0.637895
O  -1.202034 -0.021346 -1.451822
N  -0.273253 1.604612 0.810971
N  0.602256 1.748908 -0.189106
N  1.596324 2.167712 1.768876
C  -1.791969 -0.095743 -0.18502
C  -3.277182 -0.462835 -0.396646
C  -1.253995 -1.254088 0.731115
C  -3.690006 -1.124542 0.910157
C  -2.501351 -2.032983 1.198085
C  -4.213969 0.607353 -0.980464
C  -1.649529 1.253009 0.540793
C  -0.240775 -2.185686 0.061952
C  -4.899641 1.491866 0.060112
C  -5.279061 -0.058194 -1.850576
C  1.133495 -1.604958 -0.128763
C  0.340153 1.857543 1.972863
C  1.663416 -1.376798 -1.394237
C  1.924637 -1.296078 0.973937
C  2.932708 -0.845099 -1.560552
C  3.192765 -0.759687 0.829931
C  1.710748 2.080627 0.430745
C  3.688537 -0.534017 -0.443424
H  -3.224904 -1.267916 -1.142144
H  -0.770397 -0.821851 1.613586
H  -4.629719 -1.673638 0.829906
H  -3.824785 -0.389982 1.710426
H  -2.429637 -2.336441 2.243503
H  -2.603516 -2.951032 0.611971
H  -3.615996 1.245256 -1.640698
H  -2.164647 1.230533 1.501596
H  -2.087608 2.053881 -0.057372
H  -0.638899 -2.532248 -0.893925
H  -0.152418 -3.076192 0.693126
H  -0.375325 0.482071 -1.397306
H  -4.205159 1.999112 0.729493
H  -5.587639 0.915753 0.681696
H  -5.487504 2.268035 -0.43195
H  -5.886652 -0.757066 -1.27067
H  -4.827377 -0.61411 -2.672836
H  -5.956729 0.678822 -2.284164
H  -0.164053 1.814638 2.926394
H  1.072621 -1.612014 -2.270532
H  1.546907 -1.471252 1.974706
H  3.326851 -0.668676 -2.55196
H  3.783492 -0.507499 1.699344
H  2.628969 2.264935 -0.103724
totalener: -1400.14163680 hartree
nucrepener: 2215.16025782 hartree
electener: -3615.30189462 hartree
oneelecener: -6314.64294762 hartree
twoeener: 2699.34105300 hartree
kineticenergy: 1395.25779769 hartree
xcener: -114.442653552049 hartree
chargesum: 0.0000000
charge: -0.088795 -0.375617 0.131416 -0.333776 -0.323508 0.486891 -0.059822 -0.059113 -0.203512 -0.165158 -0.011947 -0.272213 -0.115712 -0.293140 -0.277568 0.070250 0.019023 -0.214320 -0.236537 -0.086775 -0.086436 0.077095 0.030814 0.065230 0.063353 0.080530 0.065807 0.077873 0.082211 0.052218 0.102317 0.131195 0.085788 0.106420 0.205817 0.083673 0.082928 0.095973 0.077376 0.089297 0.083940 0.138573 0.127530 0.110331 0.119493 0.121963 0.138625
qa: -0.0888 -0.3756 0.1314 -0.3338 -0.3235 0.4869 -0.0598 -0.0591 -0.2035 -0.1652 -0.0119 -0.2722 -0.1157 -0.2931 -0.2776 0.0702 0.0190 -0.2143 -0.2365 -0.0868 -0.0864 0.0771 0.0308 0.0652 0.0634 0.0805 0.0658 0.0779 0.0822 0.0522 0.1023 0.1312 0.0858 0.1064 0.2058 0.0837 0.0829 0.0960 0.0774 0.0893 0.0839 0.1386 0.1275 0.1103 0.1195 0.1220 0.1386
va: 1.2163 2.0868 3.3062 2.8411 3.0365 3.7486 3.8010 3.8338 3.9899 3.9520 3.8300 4.0058 3.8406 3.9312 3.9390 3.5711 4.0924 3.9888 3.9594 3.9772 3.9213 4.0195 3.8975 1.0305 1.0108 1.0180 1.0059 1.0145 1.0088 1.0336 0.9897 0.9926 1.0194 1.0012 1.0824 1.0031 0.9975 1.0098 1.0030 1.0079 1.0061 1.0031 1.0153 1.0103 1.0122 1.0155 1.0006
dispcorr: -0.030566617 hartree
energy: -1400.172203416434
dipole: -50.52419 48.84464 -1.67955 -5.65503 5.29377 -0.36127 1.48098 -0.86741 0.61357
magnitude: 1.82425 au
magnitude: 4.63687 debye
