program: Orca
programVersion: 4.2.1
elementType: Cl O N N N C C C C C C C C C C C C C C C C C C H H H H H H H H H H H H H H H H H H H H H H H H
charge: 0
multiplicity: 1
keywords: wb97x-d3
keywords: def2-TZVPP
keywords: def2/J RIJCOSX GRIDX6 NOFINALGRIDX
keywords: grid4 nofinalgrid
keywords: scfconv7
keywords: smallprint printgap noloewdin
keywords: NOSOSCF
formula: C18H24ClN3O
InChI: InChI=1/C18H24ClN3O/c1-13(2)17-8-5-15(9-14-3-6-16(19)7-4-14)18(17,23)10-22-12-20-11-21-22/h3-4,6-7,11-13,15,17,23H,5,8-10H2,1-2H3
47 atoms
Cl 5.179093 0.445237 0.900543
O  -1.303887 0.048588 1.109277
N  -0.20651 -1.994623 -0.573712
N  0.614644 -1.913646 -1.625234
N  1.745059 -2.575198 0.195106
C  -1.833853 -0.14412 -0.182815
C  -3.374991 0.105576 -0.137855
C  -1.26799 0.867551 -1.238403
C  -3.571618 1.443049 -0.851476
C  -2.517359 1.404814 -1.942624
C  -4.056864 0.009257 1.23266
C  -1.595262 -1.596544 -0.633466
C  -0.434643 2.014311 -0.642885
C  -5.529923 0.397432 1.113556
C  -3.960642 -1.38246 1.852856
C  0.962732 1.6238 -0.234299
C  0.483538 -2.385778 0.499826
C  1.880038 1.20684 -1.198312
C  1.391037 1.680022 1.090229
C  3.173999 0.85076 -0.861016
C  2.683337 1.318883 1.450534
C  1.765589 -2.266234 -1.113118
C  3.564016 0.90402 0.467971
H  -3.838181 -0.660826 -0.776267
H  -0.634202 0.344274 -1.958308
H  -3.39438 2.27847 -0.165796
H  -4.580669 1.560494 -1.246903
H  -2.832949 0.712077 -2.727814
H  -2.342819 2.369602 -2.421494
H  -3.581427 0.724942 1.910137
H  -1.938017 -1.738651 -1.657218
H  -2.160146 -2.283331 -0.003324
H  -0.951065 2.48619 0.194857
H  -0.351078 2.782473 -1.415824
H  -0.340994 0.035233 1.07183
H  -6.051472 -0.242414 0.396977
H  -6.035303 0.28935 2.074996
H  -5.665197 1.430798 0.793721
H  -4.501292 -1.416674 2.80079
H  -2.935038 -1.684421 2.058918
H  -4.40889 -2.135319 1.199308
H  0.029853 -2.547244 1.465057
H  1.585186 1.16331 -2.239242
H  0.71348 2.023688 1.863058
H  3.867653 0.532479 -1.627298
H  2.991657 1.366167 2.48615
H  2.658635 -2.312487 -1.715484
elementType: Cl O N C H
totalener: -1400.15560274 hartree
nucrepener: 2208.24731566 hartree
electener: -3608.40291840 hartree
oneelecener: -6300.88995025 hartree
twoeener: 2692.48703185 hartree
cpcmener: -0.02629956 hartree
kineticenergy: 1395.27372833 hartree
xcener: -114.441988997462 hartree
chargesum: -0.0000000
charge: -0.107998 -0.428188 0.130994 -0.359048 -0.395769 0.254081 -0.043711 0.094639 -0.202584 -0.188516 0.090519 -0.214893 -0.117733 -0.314974 -0.343284 -0.027285 0.015851 -0.207948 -0.195764 -0.160688 -0.173394 0.065692 0.126630 0.082568 0.073942 0.082765 0.082435 0.091175 0.076506 0.026017 0.126304 0.167145 0.104841 0.101477 0.219756 0.087529 0.091630 0.094183 0.097432 0.090009 0.088126 0.182420 0.136356 0.155802 0.143608 0.144820 0.156527
qa: -0.1080 -0.4282 0.1310 -0.3590 -0.3958 0.2541 -0.0437 0.0946 -0.2026 -0.1885 0.0905 -0.2149 -0.1177 -0.3150 -0.3433 -0.0273 0.0159 -0.2079 -0.1958 -0.1607 -0.1734 0.0657 0.1266 0.0826 0.0739 0.0828 0.0824 0.0912 0.0765 0.0260 0.1263 0.1671 0.1048 0.1015 0.2198 0.0875 0.0916 0.0942 0.0974 0.0900 0.0881 0.1824 0.1364 0.1558 0.1436 0.1448 0.1565
va: 1.1979 1.9991 3.3300 2.8743 3.0273 3.8722 3.8027 3.6800 3.9572 3.9974 3.7590 3.9377 3.8183 3.9387 3.9370 3.5242 4.0770 3.9255 3.9071 3.9419 4.0327 4.0532 3.7688 1.0136 1.0347 1.0024 1.0133 1.0050 1.0161 1.0342 1.0153 0.9769 1.0082 1.0060 1.0529 0.9996 1.0058 1.0010 1.0080 1.0153 0.9992 0.9970 1.0092 1.0061 1.0054 1.0053 0.9984
dispcorr: -0.029977826 hartree
energy: -1400.185580568404
dipole: -48.94669 46.70940 -2.23730 3.90630 -3.25488 0.65142 -1.24667 0.64303 -0.60364
magnitude: 2.40712 au
magnitude: 6.11841 debye
