program: Orca
programVersion: 4.2.1
elementType: Cl O N N N C C C C C C C C C C C C C C C C C C H H H H H H H H H H H H H H H H H H H H H H H H
charge: 0
multiplicity: 1
keywords: wb97x-d3
keywords: def2-TZVPP
keywords: def2/J RIJCOSX GRIDX6 NOFINALGRIDX
keywords: grid4 nofinalgrid
keywords: scfconv7
keywords: smallprint printgap noloewdin
keywords: NOSOSCF
formula: C18H24ClN3O
InChI: InChI=1/C18H24ClN3O/c1-13(2)17-8-5-15(9-14-3-6-16(19)7-4-14)18(17,23)10-22-12-20-11-21-22/h3-4,6-7,11-13,15,17,23H,5,8-10H2,1-2H3
47 atoms
Cl 5.098241 0.525754 1.134303
O  -1.248538 0.037671 1.06071
N  -0.217888 -2.029574 -0.636537
N  0.570496 -1.991488 -1.715059
N  1.740451 -2.654801 0.07982
C  -1.814869 -0.156755 -0.215159
C  -3.352622 0.105926 -0.133733
C  -1.268365 0.839447 -1.29324
C  -3.560575 1.42755 -0.873627
C  -2.531208 1.357474 -1.987493
C  -3.994288 0.041357 1.257785
C  -1.602773 -1.613209 -0.664528
C  -0.44151 2.005118 -0.729804
C  -5.463454 0.452811 1.178453
C  -3.901844 -1.344698 1.891236
C  0.938216 1.63285 -0.250188
C  0.495854 -2.420815 0.421422
C  1.338622 1.852872 1.066777
C  1.864492 1.072059 -1.129008
C  2.614012 1.518428 1.502008
C  3.141397 0.733038 -0.714688
C  1.727223 -2.368649 -1.233573
C  3.504247 0.955653 0.604259
H  -3.839043 -0.670544 -0.742018
H  -0.639831 0.309269 -2.012851
H  -3.364245 2.278635 -0.213128
H  -4.578146 1.540249 -1.248041
H  -2.864297 0.642732 -2.745586
H  -2.366214 2.307991 -2.497866
H  -3.486474 0.757395 1.911063
H  -1.969539 -1.755185 -1.680149
H  -2.162776 -2.291146 -0.020324
H  -0.981215 2.5229 0.06555
H  -0.327514 2.732556 -1.538299
H  -0.28735 0.0452 0.993886
H  -5.590694 1.484946 0.851294
H  -6.017198 -0.185723 0.4851
H  -5.941258 0.363908 2.155955
H  -4.386646 -2.095722 1.261862
H  -4.409168 -1.358871 2.857948
H  -2.875521 -1.664906 2.064565
H  0.068741 -2.552245 1.403189
H  0.647639 2.299735 1.771508
H  1.59302 0.898955 -2.162656
H  2.901771 1.696009 2.529352
H  3.842451 0.298167 -1.413965
H  2.598437 -2.451498 -1.863953
elementType: Cl O N C H
totalener: -1400.15608014 hartree
nucrepener: 2206.36213732 hartree
electener: -3606.51821746 hartree
oneelecener: -6297.07426743 hartree
twoeener: 2690.55604996 hartree
cpcmener: -0.02636147 hartree
kineticenergy: 1395.26958965 hartree
xcener: -114.441479766747 hartree
chargesum: 0.0000000
charge: -0.107229 -0.427079 0.128942 -0.358545 -0.395478 0.254164 -0.048989 0.101618 -0.202998 -0.190180 0.093082 -0.217164 -0.112699 -0.315150 -0.343774 -0.027810 0.023933 -0.198736 -0.223020 -0.161118 -0.143718 0.055239 0.112909 0.083155 0.072875 0.082518 0.082592 0.091503 0.077249 0.025594 0.128243 0.166099 0.102585 0.101837 0.223322 0.093748 0.087683 0.091562 0.088378 0.097235 0.090674 0.180949 0.151837 0.135899 0.145164 0.141538 0.161560
qa: -0.1072 -0.4271 0.1289 -0.3585 -0.3955 0.2542 -0.0490 0.1016 -0.2030 -0.1902 0.0931 -0.2172 -0.1127 -0.3152 -0.3438 -0.0278 0.0239 -0.1987 -0.2230 -0.1611 -0.1437 0.0552 0.1129 0.0832 0.0729 0.0825 0.0826 0.0915 0.0772 0.0256 0.1282 0.1661 0.1026 0.1018 0.2233 0.0937 0.0877 0.0916 0.0884 0.0972 0.0907 0.1809 0.1518 0.1359 0.1452 0.1415 0.1616
va: 1.1992 1.9980 3.3298 2.8608 3.0283 3.8680 3.8104 3.6885 3.9527 4.0028 3.7561 3.9322 3.8187 3.9389 3.9360 3.5645 4.0758 3.9176 3.9416 4.0179 3.9395 4.0517 3.8032 1.0135 1.0325 1.0024 1.0136 1.0054 1.0157 1.0348 1.0148 0.9780 1.0055 1.0048 1.0464 1.0012 0.9996 1.0059 0.9992 1.0080 1.0149 0.9974 1.0053 1.0127 1.0050 1.0066 0.9966
dispcorr: -0.029831224 hartree
energy: -1400.185911367840
dipole: -48.37737 46.15538 -2.22200 3.83323 -3.13712 0.69611 -1.95047 1.32839 -0.62209
magnitude: 2.41015 au
magnitude: 6.12612 debye
