program: Orca
programVersion: 4.2.1
elementType: Cl O N N N C C C C C C C C C C C C C C C C C C H H H H H H H H H H H H H H H H H H H H H H H H
charge: 0
multiplicity: 1
keywords: wb97x-d3
keywords: def2-TZVPP
keywords: def2/J RIJCOSX GRIDX6 NOFINALGRIDX
keywords: grid4 nofinalgrid
keywords: scfconv7
keywords: smallprint printgap noloewdin
keywords: NOSOSCF
formula: C18H24ClN3O
InChI: InChI=1/C18H24ClN3O/c1-13(2)17-8-5-15(9-14-3-6-16(19)7-4-14)18(17,23)10-22-12-20-11-21-22/h3-4,6-7,11-13,15,17,23H,5,8-10H2,1-2H3
47 atoms
Cl 5.057627 3.312765 -0.490791
O  -2.064289 -1.489018 1.357769
N  -0.669687 -2.817172 -0.888075
N  -0.313409 -3.449504 0.237348
N  1.351311 -3.532754 -1.256824
C  -1.990117 -0.945405 0.060073
C  -3.263446 -0.099519 -0.260469
C  -0.77708 0.034639 -0.121123
C  -2.68934 1.052885 -1.089157
C  -1.401938 1.406866 -0.365323
C  -4.055623 0.336742 0.994393
C  -1.915171 -2.084145 -0.969613
C  0.254134 0.003941 1.00818
C  -4.877247 1.603362 0.768382
C  -4.99973 -0.780139 1.438039
C  1.459746 0.831112 0.663869
C  0.3363 -2.864822 -1.75849
C  1.604869 2.136751 1.12311
C  2.454393 0.311577 -0.16211
C  2.70486 2.907619 0.773295
C  3.561229 1.063639 -0.523548
C  0.902802 -3.857156 -0.032476
C  3.675508 2.36166 -0.050164
H  -3.95394 -0.688688 -0.876776
H  -0.254355 -0.237654 -1.046374
H  -3.37538 1.88867 -1.214454
H  -2.452741 0.699074 -2.097692
H  -0.750443 2.068958 -0.936783
H  -1.621599 1.909248 0.582943
H  -3.360348 0.548051 1.811957
H  -1.987304 -1.692077 -1.982879
H  -2.742566 -2.780172 -0.824199
H  0.582267 -1.020811 1.20114
H  -0.195922 0.371303 1.932472
H  -1.401438 -2.190909 1.435062
H  -5.537472 1.509428 -0.097356
H  -5.508806 1.798484 1.637471
H  -4.258018 2.488681 0.621991
H  -5.484731 -0.533235 2.38459
H  -4.489615 -1.732459 1.566358
H  -5.789586 -0.926851 0.696415
H  0.284361 -2.420469 -2.739879
H  0.850649 2.567334 1.770259
H  2.371703 -0.705427 -0.529068
H  2.800376 3.919546 1.143018
H  4.324637 0.639066 -1.161251
H  1.482733 -4.416845 0.68428
elementType: Cl O N C H
totalener: -1400.15681544 hartree
nucrepener: 2131.88834158 hartree
electener: -3532.04515702 hartree
oneelecener: -6147.81146104 hartree
twoeener: 2615.76630402 hartree
cpcmener: -0.02768290 hartree
kineticenergy: 1395.25158933 hartree
xcener: -114.438591245233 hartree
chargesum: -0.0000000
charge: -0.108248 -0.428896 0.139695 -0.396974 -0.414678 0.282687 0.016183 0.000091 -0.190472 -0.228006 0.052459 -0.165482 -0.149044 -0.322934 -0.323269 0.068453 0.053768 -0.221926 -0.225268 -0.151419 -0.171948 0.089263 0.096424 0.079192 0.094527 0.088711 0.089401 0.086446 0.083291 0.043777 0.121957 0.132431 0.107098 0.102483 0.216670 0.092050 0.092398 0.088081 0.091827 0.091014 0.081512 0.184138 0.141217 0.139027 0.144381 0.143463 0.164452
qa: -0.1082 -0.4289 0.1397 -0.3970 -0.4147 0.2827 0.0162 0.0001 -0.1905 -0.2280 0.0525 -0.1655 -0.1490 -0.3229 -0.3233 0.0685 0.0538 -0.2219 -0.2253 -0.1514 -0.1719 0.0893 0.0964 0.0792 0.0945 0.0887 0.0894 0.0864 0.0833 0.0438 0.1220 0.1324 0.1071 0.1025 0.2167 0.0920 0.0924 0.0881 0.0918 0.0910 0.0815 0.1841 0.1412 0.1390 0.1444 0.1435 0.1645
va: 1.1965 1.9732 3.3017 2.8400 2.9894 3.9011 3.7832 3.7287 3.9731 3.9922 3.7425 3.9680 3.7639 3.9486 3.9140 3.4761 4.0221 3.9826 3.9727 3.9842 4.0419 4.0007 3.8023 1.0009 1.0175 1.0086 1.0108 1.0135 1.0028 1.0264 0.9990 0.9989 1.0274 1.0232 1.0586 0.9989 1.0055 0.9991 1.0045 1.0308 1.0024 0.9894 1.0053 1.0161 1.0048 1.0067 0.9948
dispcorr: -0.027527831 hartree
energy: -1400.184343267179
dipole: -44.93237 43.30722 -1.62515 -3.43104 3.52600 0.09496 4.41161 -5.46016 -1.04855
magnitude: 1.93638 au
magnitude: 4.92190 debye
