program: Orca
programVersion: 4.2.1
elementType: Cl O N N N C C C C C C C C C C C C C C C C C C H H H H H H H H H H H H H H H H H H H H H H H H
charge: 0
multiplicity: 1
keywords: wb97x-d3
keywords: def2-TZVPP
keywords: def2/J RIJCOSX GRIDX6 NOFINALGRIDX
keywords: grid4 nofinalgrid
keywords: scfconv7
keywords: smallprint printgap noloewdin
keywords: NOSOSCF
formula: C18H24ClN3O
InChI: InChI=1/C18H24ClN3O/c1-13(2)17-8-5-15(9-14-3-6-16(19)7-4-14)18(17,23)10-22-12-20-11-21-22/h3-4,6-7,11-13,15,17,23H,5,8-10H2,1-2H3
47 atoms
Cl 4.959592 4.670256 -0.673254
O  -1.064216 -1.194725 1.572643
N  -1.249175 -3.447188 -0.313782
N  -1.649811 -3.91992 0.873107
N  -2.812463 -4.887579 -0.778838
C  -0.906265 -1.04902 0.178088
C  -2.222625 -0.640537 -0.569117
C  0.061462 0.13052 -0.062934
C  -2.003727 0.818404 -1.023003
C  -0.859545 1.341265 -0.166364
C  -3.53166 -0.872197 0.210622
C  -0.32068 -2.340139 -0.411156
C  1.192226 0.262118 0.958136
C  -3.830812 0.17242 1.283385
C  -4.70086 -0.959142 -0.766948
C  2.151302 1.354136 0.575747
C  -1.959537 -4.023816 -1.280897
C  3.145516 1.131499 -0.374288
C  2.04839 2.626919 1.130262
C  4.01248 2.141229 -0.763893
C  2.90423 3.652105 0.753691
C  -2.583313 -4.777478 0.539891
C  3.881445 3.398214 -0.194519
H  -2.299137 -1.260983 -1.467835
H  0.513669 -0.020403 -1.051914
H  -2.905006 1.428871 -0.952618
H  -1.702469 0.83657 -2.072871
H  -0.365242 2.210412 -0.602415
H  -1.213941 1.632631 0.827358
H  -3.47154 -1.84732 0.706751
H  0.60616 -2.616147 0.094236
H  -0.095442 -2.20684 -1.467715
H  1.735359 -0.683466 1.039107
H  0.778695 0.47549 1.944612
H  -1.525914 -2.025706 1.751182
H  -4.044109 1.150514 0.847762
H  -4.71595 -0.117898 1.85284
H  -3.011811 0.292316 1.989143
H  -4.806905 -0.040778 -1.349553
H  -5.643305 -1.120264 -0.24024
H  -4.571881 -1.785012 -1.469969
H  -1.815356 -3.803153 -2.326606
H  3.254287 0.149757 -0.81982
H  1.286993 2.828916 1.873828
H  4.780639 1.94637 -1.499896
H  2.807179 4.63346 1.197831
H  -3.115938 -5.348159 1.284081
elementType: Cl O N C H
totalener: -1400.15973852 hartree
nucrepener: 2094.36904492 hartree
electener: -3494.52878345 hartree
oneelecener: -6072.72559228 hartree
twoeener: 2578.19680883 hartree
cpcmener: -0.02978444 hartree
kineticenergy: 1395.26515506 hartree
xcener: -114.440648197795 hartree
chargesum: -0.0000000
charge: -0.108686 -0.452263 0.131464 -0.398165 -0.408439 0.378227 -0.065153 0.024823 -0.197874 -0.233445 0.022018 -0.148921 -0.100187 -0.312457 -0.304424 0.028044 0.051986 -0.227380 -0.221572 -0.156958 -0.151621 0.085574 0.092959 0.082372 0.088329 0.086961 0.092790 0.087637 0.086956 0.027399 0.132938 0.114013 0.099593 0.086391 0.219793 0.086828 0.101424 0.089543 0.087041 0.092624 0.086796 0.184297 0.143775 0.141903 0.144501 0.144954 0.163592
qa: -0.1087 -0.4523 0.1315 -0.3982 -0.4084 0.3782 -0.0652 0.0248 -0.1979 -0.2334 0.0220 -0.1489 -0.1002 -0.3125 -0.3044 0.0280 0.0520 -0.2274 -0.2216 -0.1570 -0.1516 0.0856 0.0930 0.0824 0.0883 0.0870 0.0928 0.0876 0.0870 0.0274 0.1329 0.1140 0.0996 0.0864 0.2198 0.0868 0.1014 0.0895 0.0870 0.0926 0.0868 0.1843 0.1438 0.1419 0.1445 0.1450 0.1636
va: 1.1967 1.9711 3.3189 2.8416 3.0108 3.7675 3.8649 3.7393 3.9745 4.0053 3.8260 3.9758 3.8156 3.9033 3.9405 3.5140 4.0371 3.9886 3.9619 3.9836 3.9847 4.0122 3.8128 1.0069 1.0188 1.0112 1.0042 1.0157 1.0017 1.0352 0.9977 1.0028 1.0179 1.0275 1.0548 0.9995 1.0041 1.0275 1.0028 1.0042 1.0045 0.9897 1.0038 1.0050 1.0051 1.0048 0.9952
dispcorr: -0.027178915 hartree
energy: -1400.186917437770
dipole: -34.84583 34.78410 -0.06173 -11.18393 10.92776 -0.25616 1.10249 -2.16359 -1.06110
magnitude: 1.09333 au
magnitude: 2.77902 debye
