program: Orca
programVersion: 4.2.1
elementType: Cl O N N N C C C C C C C C C C C C C C C C C C H H H H H H H H H H H H H H H H H H H H H H H H
charge: 0
multiplicity: 1
keywords: wb97x-d3
keywords: def2-TZVPP
keywords: def2/J RIJCOSX GRIDX6 NOFINALGRIDX
keywords: grid4 nofinalgrid
keywords: scfconv7
keywords: smallprint printgap noloewdin
keywords: NOSOSCF
formula: C18H24ClN3O
InChI: InChI=1/C18H24ClN3O/c1-13(2)17-8-5-15(9-14-3-6-16(19)7-4-14)18(17,23)10-22-12-20-11-21-22/h3-4,6-7,11-13,15,17,23H,5,8-10H2,1-2H3
47 atoms
Cl 5.331456 3.043931 -0.864086
O  -2.03419 -1.086264 1.516732
N  -0.718609 -2.759539 -0.53286
N  -0.407626 -3.289241 0.656878
N  1.279743 -3.580697 -0.785361
C  -1.963942 -0.731973 0.15283
C  -3.206069 0.113852 -0.190004
C  -0.754773 0.213434 -0.164808
C  -2.780153 1.528724 0.189618
C  -1.368623 1.614303 -0.377607
C  -4.55995 -0.37727 0.352491
C  -1.931732 -1.992599 -0.720465
C  0.33178 0.196444 0.919837
C  -4.889926 0.11175 1.76054
C  -5.67991 0.037554 -0.599743
C  1.579645 0.913094 0.488022
C  0.300529 -2.929194 -1.372685
C  1.852636 2.214294 0.899778
C  2.499066 0.285923 -0.351335
C  2.999521 2.878827 0.487827
C  3.652032 0.929554 -0.772179
C  0.797147 -3.76565 0.454845
C  3.89091 2.227973 -0.3482
H  -3.274399 0.099256 -1.286413
H  -0.288678 -0.112116 -1.100229
H  -2.76504 1.652994 1.275332
H  -3.444649 2.294609 -0.214095
H  -1.415511 1.842857 -1.44456
H  -0.778066 2.407214 0.083877
H  -4.54353 -1.472843 0.375772
H  -1.975673 -1.721538 -1.773784
H  -2.787126 -2.635261 -0.505875
H  0.603047 -0.832074 1.17278
H  -0.051449 0.650065 1.836298
H  -1.401296 -1.797575 1.690524
H  -4.11358 -0.131086 2.48292
H  -5.039935 1.193439 1.781535
H  -5.81819 -0.345572 2.109025
H  -5.537728 -0.381787 -1.597452
H  -5.73049 1.124432 -0.702128
H  -6.652493 -0.300456 -0.236771
H  0.282431 -2.58402 -2.394374
H  1.166076 2.724512 1.564202
H  2.323652 -0.732866 -0.678243
H  3.193081 3.888912 0.822377
H  4.356439 0.421117 -1.416447
H  1.343501 -4.270952 1.235349
elementType: Cl O N C H
totalener: -1400.15918757 hartree
nucrepener: 2121.44154655 hartree
electener: -3521.60073412 hartree
oneelecener: -6126.96956474 hartree
twoeener: 2605.36883062 hartree
cpcmener: -0.02850237 hartree
kineticenergy: 1395.25165872 hartree
xcener: -114.438135079822 hartree
chargesum: -0.0000000
charge: -0.107841 -0.445904 0.141747 -0.399766 -0.414215 0.426964 -0.045805 -0.086193 -0.224777 -0.166888 0.022804 -0.152841 -0.142322 -0.326018 -0.299957 0.064789 0.046642 -0.228637 -0.234448 -0.155696 -0.170643 0.089835 0.097424 0.084647 0.089926 0.085843 0.084184 0.092416 0.084631 0.034079 0.114167 0.136092 0.109345 0.109334 0.217858 0.095400 0.082338 0.098961 0.088203 0.084792 0.090072 0.186030 0.145874 0.146215 0.144942 0.142320 0.164076
qa: -0.1078 -0.4459 0.1417 -0.3998 -0.4142 0.4270 -0.0458 -0.0862 -0.2248 -0.1669 0.0228 -0.1528 -0.1423 -0.3260 -0.3000 0.0648 0.0466 -0.2286 -0.2344 -0.1557 -0.1706 0.0898 0.0974 0.0846 0.0899 0.0858 0.0842 0.0924 0.0846 0.0341 0.1142 0.1361 0.1093 0.1093 0.2179 0.0954 0.0823 0.0990 0.0882 0.0848 0.0901 0.1860 0.1459 0.1462 0.1449 0.1423 0.1641
va: 1.1974 1.9909 3.3005 2.8358 2.9858 3.7927 3.7622 3.8896 4.0386 3.9369 3.8387 3.9256 3.7515 3.9203 3.9266 3.4570 4.0148 3.9945 3.9767 3.9909 4.0476 4.0048 3.8064 1.0092 1.0134 1.0017 1.0135 1.0052 1.0168 1.0304 1.0035 0.9981 1.0247 1.0258 1.0552 1.0226 0.9953 1.0040 1.0048 1.0013 1.0043 0.9889 1.0017 1.0131 1.0053 1.0080 0.9951
dispcorr: -0.027253038 hartree
energy: -1400.186440608603
dipole: -47.23729 45.56824 -1.66904 -3.12693 3.12182 -0.00511 4.24649 -5.34846 -1.10197
magnitude: 2.00002 au
magnitude: 5.08364 debye
