program: Orca
programVersion: 4.2.1
elementType: Cl O N N N C C C C C C C C C C C C C C C C C C H H H H H H H H H H H H H H H H H H H H H H H H
charge: 0
multiplicity: 1
keywords: wb97x-d3
keywords: def2-TZVPP
keywords: def2/J RIJCOSX GRIDX6 NOFINALGRIDX
keywords: grid4 nofinalgrid
keywords: scfconv7
keywords: smallprint printgap noloewdin
keywords: NOSOSCF
formula: C18H24ClN3O
InChI: InChI=1/C18H24ClN3O/c1-13(2)17-8-5-15(9-14-3-6-16(19)7-4-14)18(17,23)10-22-12-20-11-21-22/h3-4,6-7,11-13,15,17,23H,5,8-10H2,1-2H3
47 atoms
Cl 4.945981 4.718909 -0.125799
O  -0.704201 -1.830355 1.295891
N  -1.568126 -3.418502 -0.990063
N  -2.561265 -3.389393 -1.885978
N  -2.982898 -4.924613 -0.306201
C  -0.72175 -1.297013 -0.008837
C  -2.084864 -0.581969 -0.282455
C  0.373974 -0.221288 -0.269303
C  -1.731246 0.881584 -0.567555
C  -0.337683 0.7875 -1.171471
C  -3.215145 -0.823609 0.730024
C  -0.495952 -2.446227 -1.004309
C  0.892088 0.41647 1.030342
C  -3.096966 -0.016936 2.020052
C  -4.565106 -0.544994 0.072039
C  1.905221 1.493138 0.765272
C  -1.841256 -4.327454 -0.055202
C  1.576144 2.840145 0.884439
C  3.200467 1.167763 0.367009
C  2.501393 3.83886 0.614077
C  4.139802 2.149023 0.091785
C  -3.378423 -4.303523 -1.431294
C  3.778547 3.481743 0.216771
H  -2.451569 -0.981505 -1.232576
H  1.233647 -0.667245 -0.781999
H  -1.704502 1.48065 0.345705
H  -2.450958 1.354928 -1.237011
H  -0.398644 0.397651 -2.191819
H  0.179966 1.745506 -1.232139
H  -3.206016 -1.885604 0.995246
H  0.437895 -2.964096 -0.772575
H  -0.411387 -2.072952 -2.023574
H  1.355978 -0.351427 1.653061
H  0.066911 0.828834 1.615024
H  0.153218 -2.243757 1.448377
H  -2.117809 -0.109717 2.487463
H  -3.285738 1.044981 1.849171
H  -3.839016 -0.356216 2.745446
H  -4.648779 0.49508 -0.251375
H  -5.386468 -0.736939 0.765092
H  -4.717906 -1.180707 -0.802362
H  -1.180574 -4.543488 0.767778
H  0.578311 3.12401 1.19612
H  3.489946 0.128075 0.2713
H  2.223614 4.87906 0.714732
H  5.14047 1.874669 -0.212799
H  -4.296654 -4.540424 -1.945078
elementType: Cl O N C H
totalener: -1400.15629432 hartree
nucrepener: 2100.49257986 hartree
electener: -3500.64887417 hartree
oneelecener: -6084.85367023 hartree
twoeener: 2584.20479605 hartree
cpcmener: -0.03512128 hartree
kineticenergy: 1395.27119680 hartree
xcener: -114.440146986873 hartree
chargesum: -0.0000000
charge: -0.108436 -0.401670 0.125348 -0.350927 -0.415343 0.312799 -0.059109 0.090047 -0.211399 -0.224754 0.051762 -0.181051 -0.113849 -0.343388 -0.310438 -0.001119 0.054815 -0.219555 -0.220474 -0.155612 -0.164214 0.057137 0.102192 0.086777 0.089709 0.084843 0.086313 0.092500 0.091791 0.037250 0.134811 0.123351 0.100190 0.098914 0.206124 0.097714 0.084023 0.102792 0.087355 0.093765 0.085897 0.163731 0.144503 0.144109 0.144395 0.144321 0.162060
qa: -0.1084 -0.4017 0.1253 -0.3509 -0.4153 0.3128 -0.0591 0.0900 -0.2114 -0.2248 0.0518 -0.1811 -0.1138 -0.3434 -0.3104 -0.0011 0.0548 -0.2196 -0.2205 -0.1556 -0.1642 0.0571 0.1022 0.0868 0.0897 0.0848 0.0863 0.0925 0.0918 0.0372 0.1348 0.1234 0.1002 0.0989 0.2061 0.0977 0.0840 0.1028 0.0874 0.0938 0.0859 0.1637 0.1445 0.1441 0.1444 0.1443 0.1621
va: 1.1967 2.0087 3.3482 2.8686 3.0168 3.9113 3.7687 3.7647 3.9720 3.9955 3.7622 3.9487 3.7996 3.9334 3.9274 3.5835 4.0677 3.9429 3.9978 4.0007 3.9925 4.0366 3.8034 1.0296 1.0123 0.9966 1.0151 1.0100 1.0113 1.0244 0.9964 1.0132 1.0231 1.0035 1.0192 1.0182 0.9959 1.0041 1.0002 1.0039 1.0078 1.0082 1.0024 1.0028 1.0055 1.0054 0.9965
dispcorr: -0.027544956 hartree
energy: -1400.183839274809
dipole: -30.47707 31.82350 1.34642 -11.27171 11.26069 -0.01103 4.08747 -3.95557 0.13190
magnitude: 1.35291 au
magnitude: 3.43883 debye
