program: Orca
programVersion: 4.2.1
elementType: Cl O N N N C C C C C C C C C C C C C C C C C C H H H H H H H H H H H H H H H H H H H H H H H H
charge: 0
multiplicity: 1
keywords: wb97x-d3
keywords: def2-TZVPP
keywords: def2/J RIJCOSX GRIDX6 NOFINALGRIDX
keywords: grid4 nofinalgrid
keywords: scfconv7
keywords: smallprint printgap noloewdin
keywords: NOSOSCF
formula: C18H24ClN3O
InChI: InChI=1/C18H24ClN3O/c1-13(2)17-8-5-15(9-14-3-6-16(19)7-4-14)18(17,23)10-22-12-20-11-21-22/h3-4,6-7,11-13,15,17,23H,5,8-10H2,1-2H3
47 atoms
Cl 4.923276 4.792075 -0.53926
O  -0.9935 -1.30949 1.49804
N  -1.388749 -3.320856 -0.50171
N  -2.1959 -3.737731 -1.482338
N  -2.450473 -5.024323 0.336961
C  -0.975356 -0.932123 0.135842
C  -2.292061 -0.274356 -0.335618
C  0.028751 0.222607 -0.09006
C  -2.213233 1.147316 0.256481
C  -0.716032 1.449889 0.448593
C  -3.645461 -0.977491 -0.132562
C  -0.534878 -2.162088 -0.651944
C  1.408863 0.019766 0.533964
C  -4.019051 -1.330289 1.30565
C  -4.752179 -0.121931 -0.750192
C  2.308427 1.196586 0.280126
C  -1.552938 -4.095002 0.570435
C  2.875832 1.398744 -0.97653
C  2.572783 2.130964 1.276915
C  3.678985 2.497731 -1.238086
C  3.374105 3.238543 1.036373
C  -2.81016 -4.753106 -0.930739
C  3.919952 3.412584 -0.224226
H  -2.173811 -0.170515 -1.421204
H  0.153032 0.337627 -1.173579
H  -2.747238 1.213519 1.207669
H  -2.691218 1.867425 -0.406666
H  -0.407852 2.360986 -0.062939
H  -0.481824 1.598885 1.506407
H  -3.621905 -1.910536 -0.699057
H  0.47218 -2.455553 -0.350968
H  -0.496976 -1.927776 -1.713651
H  1.878228 -0.881008 0.128827
H  1.305622 -0.134109 1.609647
H  -1.476148 -0.651804 2.009766
H  -3.371042 -2.091549 1.735579
H  -4.007078 -0.459747 1.966282
H  -5.035867 -1.727029 1.332445
H  -4.921513 0.796225 -0.183894
H  -5.696279 -0.669267 -0.766951
H  -4.520048 0.161351 -1.77895
H  -0.995957 -3.967021 1.483262
H  2.693676 0.684722 -1.771051
H  2.149876 1.996928 2.265072
H  4.112606 2.635204 -2.21935
H  3.567881 3.952283 1.825554
H  -3.546248 -5.327314 -1.471029
elementType: Cl O N C H
totalener: -1400.15717573 hartree
nucrepener: 2087.49689552 hartree
electener: -3487.65407125 hartree
oneelecener: -6058.67826681 hartree
twoeener: 2571.02419556 hartree
cpcmener: -0.03039666 hartree
kineticenergy: 1395.26526827 hartree
xcener: -114.441421399160 hartree
chargesum: -0.0000000
charge: -0.108440 -0.443412 0.117253 -0.363602 -0.415812 0.402873 -0.083050 -0.015381 -0.239055 -0.210242 0.072237 -0.166770 -0.098929 -0.342038 -0.313573 0.007168 0.060524 -0.210888 -0.199895 -0.165421 -0.164839 0.068311 0.101249 0.084004 0.094600 0.101866 0.085140 0.086858 0.089310 0.032327 0.147498 0.115749 0.100771 0.083843 0.223865 0.095447 0.093968 0.093427 0.088994 0.096392 0.095053 0.167018 0.143101 0.141061 0.144922 0.144215 0.162303
qa: -0.1084 -0.4434 0.1173 -0.3636 -0.4158 0.4029 -0.0830 -0.0154 -0.2391 -0.2102 0.0722 -0.1668 -0.0989 -0.3420 -0.3136 0.0072 0.0605 -0.2109 -0.1999 -0.1654 -0.1648 0.0683 0.1012 0.0840 0.0946 0.1019 0.0851 0.0869 0.0893 0.0323 0.1475 0.1157 0.1008 0.0838 0.2239 0.0954 0.0940 0.0934 0.0890 0.0964 0.0951 0.1670 0.1431 0.1411 0.1449 0.1442 0.1623
va: 1.1968 1.9967 3.3582 2.8643 3.0193 3.8224 3.8590 3.8099 3.9841 3.9633 3.7856 3.8817 3.7860 3.9187 3.9369 3.5427 4.0522 3.9728 3.9588 3.9959 4.0010 4.0241 3.8048 1.0192 1.0198 1.0005 1.0098 1.0096 1.0118 1.0441 0.9932 1.0209 1.0173 1.0363 1.0161 1.0159 1.0027 1.0048 0.9986 1.0047 1.0021 1.0128 1.0038 1.0059 1.0055 1.0056 0.9955
dispcorr: -0.027089623 hartree
energy: -1400.184265351672
dipole: -34.91304 34.97030 0.05726 -10.97428 12.09709 1.12281 4.16905 -3.97659 0.19246
magnitude: 1.14062 au
magnitude: 2.89923 debye
