program: Orca
programVersion: 4.2.1
elementType: Cl O N N N C C C C C C C C C C C C C C C C C C H H H H H H H H H H H H H H H H H H H H H H H H
charge: 0
multiplicity: 1
keywords: wb97x-d3
keywords: def2-TZVPP
keywords: def2/J RIJCOSX GRIDX6 NOFINALGRIDX
keywords: grid4 nofinalgrid
keywords: scfconv7
keywords: smallprint printgap noloewdin
keywords: NOSOSCF
formula: C18H24ClN3O
InChI: InChI=1/C18H24ClN3O/c1-13(2)17-8-5-15(9-14-3-6-16(19)7-4-14)18(17,23)10-22-12-20-11-21-22/h3-4,6-7,11-13,15,17,23H,5,8-10H2,1-2H3
47 atoms
Cl 5.113889 0.336141 0.993111
O  -1.318613 0.15377 1.136303
N  -0.153029 -1.939127 -0.548248
N  0.632431 -1.80206 0.527852
N  1.835897 -2.503376 -1.224401
C  -1.830972 -0.141942 -0.141427
C  -3.377552 0.093746 -0.134066
C  -1.268411 0.800484 -1.263309
C  -3.574634 1.392854 -0.915321
C  -2.515357 1.302958 -1.997851
C  -4.076857 0.060806 1.230219
C  -1.562912 -1.610042 -0.504206
C  -0.423534 1.97015 -0.739236
C  -5.549658 0.438565 1.076292
C  -3.981924 -1.299115 1.915988
C  0.958818 1.582224 -0.287776
C  0.581214 -2.345235 -1.580885
C  1.369203 1.711315 1.036186
C  1.877332 1.08404 -1.20943
C  2.644195 1.33967 1.438964
C  3.155999 0.709867 -0.829735
C  1.811714 -2.139853 0.067854
C  3.526324 0.835892 0.49882
H  -3.826302 -0.706296 -0.740538
H  -0.641989 0.233706 -1.958996
H  -3.402689 2.261742 -0.271006
H  -4.582156 1.488061 -1.320825
H  -2.827706 0.573417 -2.750375
H  -2.339936 2.2440 -2.522277
H  -3.611789 0.808698 1.879517
H  -1.968404 -1.8283 -1.491339
H  -2.051989 -2.279013 0.204648
H  -0.942935 2.502867 0.059007
H  -0.319678 2.682966 -1.562296
H  -0.434926 -0.234532 1.219747
H  -6.066025 0.370999 2.035744
H  -5.683338 1.45687 0.710643
H  -6.061807 -0.232933 0.382095
H  -4.411309 -2.086533 1.290956
H  -4.539261 -1.294376 2.855084
H  -2.957225 -1.580024 2.153564
H  0.16394 -2.528725 -2.558341
H  0.684992 2.10756 1.775962
H  1.596389 0.978988 -2.250735
H  2.938187 1.440765 2.47505
H  3.848366 0.318316 -1.562353
H  2.683911 -2.139356 0.702019
elementType: Cl O N C H
totalener: -1400.15852209 hartree
nucrepener: 2220.34294964 hartree
electener: -3620.50147172 hartree
oneelecener: -6325.33668800 hartree
twoeener: 2704.83521628 hartree
cpcmener: -0.02780408 hartree
kineticenergy: 1395.26669713 hartree
xcener: -114.445360668772 hartree
chargesum: 0.0000000
charge: -0.113072 -0.451920 0.123068 -0.364417 -0.406998 0.273853 -0.025827 0.070540 -0.205264 -0.185721 0.091060 -0.204392 -0.090342 -0.314142 -0.345978 0.031778 0.049131 -0.229369 -0.236370 -0.132305 -0.134105 0.085977 0.076027 0.080171 0.071374 0.082649 0.081047 0.090492 0.075763 0.023287 0.119309 0.159794 0.095325 0.100754 0.222514 0.091598 0.093695 0.087097 0.088314 0.096350 0.087888 0.177641 0.143546 0.138019 0.143732 0.135952 0.152479
qa: -0.1131 -0.4519 0.1231 -0.3644 -0.4070 0.2739 -0.0258 0.0705 -0.2053 -0.1857 0.0911 -0.2044 -0.0903 -0.3141 -0.3460 0.0318 0.0491 -0.2294 -0.2364 -0.1323 -0.1341 0.0860 0.0760 0.0802 0.0714 0.0826 0.0810 0.0905 0.0758 0.0233 0.1193 0.1598 0.0953 0.1008 0.2225 0.0916 0.0937 0.0871 0.0883 0.0963 0.0879 0.1776 0.1435 0.1380 0.1437 0.1360 0.1525
va: 1.1906 1.9722 3.3387 2.8533 2.9969 3.8563 3.7794 3.7491 3.9644 3.9849 3.7621 3.9727 3.7924 3.9389 3.9364 3.5193 4.0661 3.9463 3.9202 3.9795 3.9100 4.0204 3.7668 1.0133 1.0144 1.0017 1.0137 1.0044 1.0160 1.0347 1.0025 0.9815 1.0154 1.0056 1.0673 1.0058 1.0009 0.9999 0.9986 1.0079 1.0201 0.9928 1.0119 1.0046 1.0041 1.0118 0.9989
dispcorr: -0.030588160 hartree
energy: -1400.189110245077
dipole: -48.89219 46.59685 -2.29534 3.72988 -3.62715 0.10273 -2.91059 1.38048 -1.53011
magnitude: 2.76050 au
magnitude: 7.01664 debye
